test_blank_record (test_split_csv.ChunkTests.test_blank_record) ... FAIL
test_crlf_input_keeps_fields_and_original_bytes (test_split_csv.ChunkTests.test_crlf_input_keeps_fields_and_original_bytes) ... FAIL
test_duplicate_id_across_chunks (test_split_csv.ChunkTests.test_duplicate_id_across_chunks) ... FAIL
test_empty_file (test_split_csv.ChunkTests.test_empty_file) ... FAIL
test_empty_item (test_split_csv.ChunkTests.test_empty_item) ... FAIL
test_existing_dangling_symlink_preserved (test_split_csv.ChunkTests.test_existing_dangling_symlink_preserved) ... FAIL
test_existing_file_preserved (test_split_csv.ChunkTests.test_existing_file_preserved) ... FAIL
test_existing_folder_preserved (test_split_csv.ChunkTests.test_existing_folder_preserved) ... FAIL
test_existing_live_symlink_preserved (test_split_csv.ChunkTests.test_existing_live_symlink_preserved) ... FAIL
test_field_over_policy_limit_refused (test_split_csv.ChunkTests.test_field_over_policy_limit_refused) ... FAIL
test_four_exact_multiple_eight (test_split_csv.ChunkTests.test_four_exact_multiple_eight) ... FAIL
test_four_four_two_and_exact_order_content (test_split_csv.ChunkTests.test_four_four_two_and_exact_order_content) ... FAIL
test_header_only_zero_chunks (test_split_csv.ChunkTests.test_header_only_zero_chunks) ... FAIL
test_invalid_utf8 (test_split_csv.ChunkTests.test_invalid_utf8) ... FAIL
test_late_parse_failure_cleans_staged_chunks (test_split_csv.ChunkTests.test_late_parse_failure_cleans_staged_chunks) ... FAIL
test_max_one (test_split_csv.ChunkTests.test_max_one) ... FAIL
test_max_ten_no_trailing_empty (test_split_csv.ChunkTests.test_max_ten_no_trailing_empty) ... FAIL
test_missing_output_parent_refused (test_split_csv.ChunkTests.test_missing_output_parent_refused) ... FAIL
test_missing_source_refused (test_split_csv.ChunkTests.test_missing_source_refused) ... FAIL
test_negative_chunk_size (test_split_csv.ChunkTests.test_negative_chunk_size) ... FAIL
test_noncanonical_id (test_split_csv.ChunkTests.test_noncanonical_id) ... FAIL
test_noninteger_chunk_size (test_split_csv.ChunkTests.test_noninteger_chunk_size) ... FAIL
test_output_equals_source_preserved (test_split_csv.ChunkTests.test_output_equals_source_preserved) ... FAIL
test_output_parent_symlink_refused (test_split_csv.ChunkTests.test_output_parent_symlink_refused) ... FAIL
test_output_under_source_file_refused (test_split_csv.ChunkTests.test_output_under_source_file_refused) ... FAIL
test_quote_followed_by_text (test_split_csv.ChunkTests.test_quote_followed_by_text) ... FAIL
test_repeated_header_in_data (test_split_csv.ChunkTests.test_repeated_header_in_data) ... FAIL
test_rerun_refuses_and_new_name_works (test_split_csv.ChunkTests.test_rerun_refuses_and_new_name_works) ... FAIL
test_source_directory_refused (test_split_csv.ChunkTests.test_source_directory_refused) ... FAIL
test_source_symlink_refused (test_split_csv.ChunkTests.test_source_symlink_refused) ... FAIL
test_too_few_fields (test_split_csv.ChunkTests.test_too_few_fields) ... FAIL
test_too_many_fields (test_split_csv.ChunkTests.test_too_many_fields) ... FAIL
test_two_exact_multiple_ten (test_split_csv.ChunkTests.test_two_exact_multiple_ten) ... FAIL
test_unclosed_quote (test_split_csv.ChunkTests.test_unclosed_quote) ... FAIL
test_utf8_bom_policy (test_split_csv.ChunkTests.test_utf8_bom_policy) ... FAIL
test_verifier_detects_content_change (test_split_csv.ChunkTests.test_verifier_detects_content_change) ... FAIL
test_verifier_detects_duplicate_id (test_split_csv.ChunkTests.test_verifier_detects_duplicate_id) ... FAIL
test_verifier_detects_missing_chunk (test_split_csv.ChunkTests.test_verifier_detects_missing_chunk) ... FAIL
test_verifier_detects_reordering (test_split_csv.ChunkTests.test_verifier_detects_reordering) ... FAIL
test_verifier_detects_repeated_header (test_split_csv.ChunkTests.test_verifier_detects_repeated_header) ... FAIL
test_verifier_detects_source_bytes_change (test_split_csv.ChunkTests.test_verifier_detects_source_bytes_change) ... FAIL
test_verifier_detects_trailing_empty_chunk (test_split_csv.ChunkTests.test_verifier_detects_trailing_empty_chunk) ... FAIL
test_wrong_header (test_split_csv.ChunkTests.test_wrong_header) ... FAIL
test_zero_chunk_size (test_split_csv.ChunkTests.test_zero_chunk_size) ... FAIL

======================================================================
FAIL: test_blank_record (test_split_csv.ChunkTests.test_blank_record)
----------------------------------------------------------------------
Traceback (most recent call last):
  File "/workspace/scratch/d4ea27e6b1cf/article_batch_5/P16/reader/tests/test_split_csv.py", line 136, in test_blank_record
    self.reject(b'id,item,memo\n\n')
  File "/workspace/scratch/d4ea27e6b1cf/article_batch_5/P16/reader/tests/test_split_csv.py", line 64, in reject
    result = self.run_cli(limit=limit)
             ^^^^^^^^^^^^^^^^^^^^^^^^^
  File "/workspace/scratch/d4ea27e6b1cf/article_batch_5/P16/reader/tests/test_split_csv.py", line 52, in run_cli
    self.assertNotIn("can't open file", result.stderr, 'CSV chunk CLI is not implemented yet')
AssertionError: "can't open file" unexpectedly found in "/opt/codex/runtimes/codex-primary-runtime/dependencies/python/bin/python: can't open file '/workspace/scratch/d4ea27e6b1cf/article_batch_5/P16/reader/split_csv.py': [Errno 2] No such file or directory\n" : CSV chunk CLI is not implemented yet

======================================================================
FAIL: test_crlf_input_keeps_fields_and_original_bytes (test_split_csv.ChunkTests.test_crlf_input_keeps_fields_and_original_bytes)
----------------------------------------------------------------------
Traceback (most recent call last):
  File "/workspace/scratch/d4ea27e6b1cf/article_batch_5/P16/reader/tests/test_split_csv.py", line 270, in test_crlf_input_keeps_fields_and_original_bytes
    self.good()
  File "/workspace/scratch/d4ea27e6b1cf/article_batch_5/P16/reader/tests/test_split_csv.py", line 56, in good
    result = self.run_cli(limit=limit, out=out)
             ^^^^^^^^^^^^^^^^^^^^^^^^^^^^^^^^^^
  File "/workspace/scratch/d4ea27e6b1cf/article_batch_5/P16/reader/tests/test_split_csv.py", line 52, in run_cli
    self.assertNotIn("can't open file", result.stderr, 'CSV chunk CLI is not implemented yet')
AssertionError: "can't open file" unexpectedly found in "/opt/codex/runtimes/codex-primary-runtime/dependencies/python/bin/python: can't open file '/workspace/scratch/d4ea27e6b1cf/article_batch_5/P16/reader/split_csv.py': [Errno 2] No such file or directory\n" : CSV chunk CLI is not implemented yet

======================================================================
FAIL: test_duplicate_id_across_chunks (test_split_csv.ChunkTests.test_duplicate_id_across_chunks)
----------------------------------------------------------------------
Traceback (most recent call last):
  File "/workspace/scratch/d4ea27e6b1cf/article_batch_5/P16/reader/tests/test_split_csv.py", line 154, in test_duplicate_id_across_chunks
    self.reject()
  File "/workspace/scratch/d4ea27e6b1cf/article_batch_5/P16/reader/tests/test_split_csv.py", line 64, in reject
    result = self.run_cli(limit=limit)
             ^^^^^^^^^^^^^^^^^^^^^^^^^
  File "/workspace/scratch/d4ea27e6b1cf/article_batch_5/P16/reader/tests/test_split_csv.py", line 52, in run_cli
    self.assertNotIn("can't open file", result.stderr, 'CSV chunk CLI is not implemented yet')
AssertionError: "can't open file" unexpectedly found in "/opt/codex/runtimes/codex-primary-runtime/dependencies/python/bin/python: can't open file '/workspace/scratch/d4ea27e6b1cf/article_batch_5/P16/reader/split_csv.py': [Errno 2] No such file or directory\n" : CSV chunk CLI is not implemented yet

======================================================================
FAIL: test_empty_file (test_split_csv.ChunkTests.test_empty_file)
----------------------------------------------------------------------
Traceback (most recent call last):
  File "/workspace/scratch/d4ea27e6b1cf/article_batch_5/P16/reader/tests/test_split_csv.py", line 118, in test_empty_file
    self.reject(b'')
  File "/workspace/scratch/d4ea27e6b1cf/article_batch_5/P16/reader/tests/test_split_csv.py", line 64, in reject
    result = self.run_cli(limit=limit)
             ^^^^^^^^^^^^^^^^^^^^^^^^^
  File "/workspace/scratch/d4ea27e6b1cf/article_batch_5/P16/reader/tests/test_split_csv.py", line 52, in run_cli
    self.assertNotIn("can't open file", result.stderr, 'CSV chunk CLI is not implemented yet')
AssertionError: "can't open file" unexpectedly found in "/opt/codex/runtimes/codex-primary-runtime/dependencies/python/bin/python: can't open file '/workspace/scratch/d4ea27e6b1cf/article_batch_5/P16/reader/split_csv.py': [Errno 2] No such file or directory\n" : CSV chunk CLI is not implemented yet

======================================================================
FAIL: test_empty_item (test_split_csv.ChunkTests.test_empty_item)
----------------------------------------------------------------------
Traceback (most recent call last):
  File "/workspace/scratch/d4ea27e6b1cf/article_batch_5/P16/reader/tests/test_split_csv.py", line 161, in test_empty_item
    self.reject(b'id,item,memo\n1,,memo\n')
  File "/workspace/scratch/d4ea27e6b1cf/article_batch_5/P16/reader/tests/test_split_csv.py", line 64, in reject
    result = self.run_cli(limit=limit)
             ^^^^^^^^^^^^^^^^^^^^^^^^^
  File "/workspace/scratch/d4ea27e6b1cf/article_batch_5/P16/reader/tests/test_split_csv.py", line 52, in run_cli
    self.assertNotIn("can't open file", result.stderr, 'CSV chunk CLI is not implemented yet')
AssertionError: "can't open file" unexpectedly found in "/opt/codex/runtimes/codex-primary-runtime/dependencies/python/bin/python: can't open file '/workspace/scratch/d4ea27e6b1cf/article_batch_5/P16/reader/split_csv.py': [Errno 2] No such file or directory\n" : CSV chunk CLI is not implemented yet

======================================================================
FAIL: test_existing_dangling_symlink_preserved (test_split_csv.ChunkTests.test_existing_dangling_symlink_preserved)
----------------------------------------------------------------------
Traceback (most recent call last):
  File "/workspace/scratch/d4ea27e6b1cf/article_batch_5/P16/reader/tests/test_split_csv.py", line 204, in test_existing_dangling_symlink_preserved
    self.assertEqual(self.run_cli().returncode, 2)
                     ^^^^^^^^^^^^^^
  File "/workspace/scratch/d4ea27e6b1cf/article_batch_5/P16/reader/tests/test_split_csv.py", line 52, in run_cli
    self.assertNotIn("can't open file", result.stderr, 'CSV chunk CLI is not implemented yet')
AssertionError: "can't open file" unexpectedly found in "/opt/codex/runtimes/codex-primary-runtime/dependencies/python/bin/python: can't open file '/workspace/scratch/d4ea27e6b1cf/article_batch_5/P16/reader/split_csv.py': [Errno 2] No such file or directory\n" : CSV chunk CLI is not implemented yet

======================================================================
FAIL: test_existing_file_preserved (test_split_csv.ChunkTests.test_existing_file_preserved)
----------------------------------------------------------------------
Traceback (most recent call last):
  File "/workspace/scratch/d4ea27e6b1cf/article_batch_5/P16/reader/tests/test_split_csv.py", line 191, in test_existing_file_preserved
    self.assertEqual(self.run_cli().returncode, 2)
                     ^^^^^^^^^^^^^^
  File "/workspace/scratch/d4ea27e6b1cf/article_batch_5/P16/reader/tests/test_split_csv.py", line 52, in run_cli
    self.assertNotIn("can't open file", result.stderr, 'CSV chunk CLI is not implemented yet')
AssertionError: "can't open file" unexpectedly found in "/opt/codex/runtimes/codex-primary-runtime/dependencies/python/bin/python: can't open file '/workspace/scratch/d4ea27e6b1cf/article_batch_5/P16/reader/split_csv.py': [Errno 2] No such file or directory\n" : CSV chunk CLI is not implemented yet

======================================================================
FAIL: test_existing_folder_preserved (test_split_csv.ChunkTests.test_existing_folder_preserved)
----------------------------------------------------------------------
Traceback (most recent call last):
  File "/workspace/scratch/d4ea27e6b1cf/article_batch_5/P16/reader/tests/test_split_csv.py", line 183, in test_existing_folder_preserved
    result = self.run_cli()
             ^^^^^^^^^^^^^^
  File "/workspace/scratch/d4ea27e6b1cf/article_batch_5/P16/reader/tests/test_split_csv.py", line 52, in run_cli
    self.assertNotIn("can't open file", result.stderr, 'CSV chunk CLI is not implemented yet')
AssertionError: "can't open file" unexpectedly found in "/opt/codex/runtimes/codex-primary-runtime/dependencies/python/bin/python: can't open file '/workspace/scratch/d4ea27e6b1cf/article_batch_5/P16/reader/split_csv.py': [Errno 2] No such file or directory\n" : CSV chunk CLI is not implemented yet

======================================================================
FAIL: test_existing_live_symlink_preserved (test_split_csv.ChunkTests.test_existing_live_symlink_preserved)
----------------------------------------------------------------------
Traceback (most recent call last):
  File "/workspace/scratch/d4ea27e6b1cf/article_batch_5/P16/reader/tests/test_split_csv.py", line 198, in test_existing_live_symlink_preserved
    self.assertEqual(self.run_cli().returncode, 2)
                     ^^^^^^^^^^^^^^
  File "/workspace/scratch/d4ea27e6b1cf/article_batch_5/P16/reader/tests/test_split_csv.py", line 52, in run_cli
    self.assertNotIn("can't open file", result.stderr, 'CSV chunk CLI is not implemented yet')
AssertionError: "can't open file" unexpectedly found in "/opt/codex/runtimes/codex-primary-runtime/dependencies/python/bin/python: can't open file '/workspace/scratch/d4ea27e6b1cf/article_batch_5/P16/reader/split_csv.py': [Errno 2] No such file or directory\n" : CSV chunk CLI is not implemented yet

======================================================================
FAIL: test_field_over_policy_limit_refused (test_split_csv.ChunkTests.test_field_over_policy_limit_refused)
----------------------------------------------------------------------
Traceback (most recent call last):
  File "/workspace/scratch/d4ea27e6b1cf/article_batch_5/P16/reader/tests/test_split_csv.py", line 324, in test_field_over_policy_limit_refused
    self.reject()
  File "/workspace/scratch/d4ea27e6b1cf/article_batch_5/P16/reader/tests/test_split_csv.py", line 64, in reject
    result = self.run_cli(limit=limit)
             ^^^^^^^^^^^^^^^^^^^^^^^^^
  File "/workspace/scratch/d4ea27e6b1cf/article_batch_5/P16/reader/tests/test_split_csv.py", line 52, in run_cli
    self.assertNotIn("can't open file", result.stderr, 'CSV chunk CLI is not implemented yet')
AssertionError: "can't open file" unexpectedly found in "/opt/codex/runtimes/codex-primary-runtime/dependencies/python/bin/python: can't open file '/workspace/scratch/d4ea27e6b1cf/article_batch_5/P16/reader/split_csv.py': [Errno 2] No such file or directory\n" : CSV chunk CLI is not implemented yet

======================================================================
FAIL: test_four_exact_multiple_eight (test_split_csv.ChunkTests.test_four_exact_multiple_eight)
----------------------------------------------------------------------
Traceback (most recent call last):
  File "/workspace/scratch/d4ea27e6b1cf/article_batch_5/P16/reader/tests/test_split_csv.py", line 101, in test_four_exact_multiple_eight
    report = self.good(4)
             ^^^^^^^^^^^^
  File "/workspace/scratch/d4ea27e6b1cf/article_batch_5/P16/reader/tests/test_split_csv.py", line 56, in good
    result = self.run_cli(limit=limit, out=out)
             ^^^^^^^^^^^^^^^^^^^^^^^^^^^^^^^^^^
  File "/workspace/scratch/d4ea27e6b1cf/article_batch_5/P16/reader/tests/test_split_csv.py", line 52, in run_cli
    self.assertNotIn("can't open file", result.stderr, 'CSV chunk CLI is not implemented yet')
AssertionError: "can't open file" unexpectedly found in "/opt/codex/runtimes/codex-primary-runtime/dependencies/python/bin/python: can't open file '/workspace/scratch/d4ea27e6b1cf/article_batch_5/P16/reader/split_csv.py': [Errno 2] No such file or directory\n" : CSV chunk CLI is not implemented yet

======================================================================
FAIL: test_four_four_two_and_exact_order_content (test_split_csv.ChunkTests.test_four_four_two_and_exact_order_content)
----------------------------------------------------------------------
Traceback (most recent call last):
  File "/workspace/scratch/d4ea27e6b1cf/article_batch_5/P16/reader/tests/test_split_csv.py", line 73, in test_four_four_two_and_exact_order_content
    report = self.good()
             ^^^^^^^^^^^
  File "/workspace/scratch/d4ea27e6b1cf/article_batch_5/P16/reader/tests/test_split_csv.py", line 56, in good
    result = self.run_cli(limit=limit, out=out)
             ^^^^^^^^^^^^^^^^^^^^^^^^^^^^^^^^^^
  File "/workspace/scratch/d4ea27e6b1cf/article_batch_5/P16/reader/tests/test_split_csv.py", line 52, in run_cli
    self.assertNotIn("can't open file", result.stderr, 'CSV chunk CLI is not implemented yet')
AssertionError: "can't open file" unexpectedly found in "/opt/codex/runtimes/codex-primary-runtime/dependencies/python/bin/python: can't open file '/workspace/scratch/d4ea27e6b1cf/article_batch_5/P16/reader/split_csv.py': [Errno 2] No such file or directory\n" : CSV chunk CLI is not implemented yet

======================================================================
FAIL: test_header_only_zero_chunks (test_split_csv.ChunkTests.test_header_only_zero_chunks)
----------------------------------------------------------------------
Traceback (most recent call last):
  File "/workspace/scratch/d4ea27e6b1cf/article_batch_5/P16/reader/tests/test_split_csv.py", line 110, in test_header_only_zero_chunks
    report = self.good()
             ^^^^^^^^^^^
  File "/workspace/scratch/d4ea27e6b1cf/article_batch_5/P16/reader/tests/test_split_csv.py", line 56, in good
    result = self.run_cli(limit=limit, out=out)
             ^^^^^^^^^^^^^^^^^^^^^^^^^^^^^^^^^^
  File "/workspace/scratch/d4ea27e6b1cf/article_batch_5/P16/reader/tests/test_split_csv.py", line 52, in run_cli
    self.assertNotIn("can't open file", result.stderr, 'CSV chunk CLI is not implemented yet')
AssertionError: "can't open file" unexpectedly found in "/opt/codex/runtimes/codex-primary-runtime/dependencies/python/bin/python: can't open file '/workspace/scratch/d4ea27e6b1cf/article_batch_5/P16/reader/split_csv.py': [Errno 2] No such file or directory\n" : CSV chunk CLI is not implemented yet

======================================================================
FAIL: test_invalid_utf8 (test_split_csv.ChunkTests.test_invalid_utf8)
----------------------------------------------------------------------
Traceback (most recent call last):
  File "/workspace/scratch/d4ea27e6b1cf/article_batch_5/P16/reader/tests/test_split_csv.py", line 127, in test_invalid_utf8
    self.reject(b'id,item,memo\n1,A,\xff\n')
  File "/workspace/scratch/d4ea27e6b1cf/article_batch_5/P16/reader/tests/test_split_csv.py", line 64, in reject
    result = self.run_cli(limit=limit)
             ^^^^^^^^^^^^^^^^^^^^^^^^^
  File "/workspace/scratch/d4ea27e6b1cf/article_batch_5/P16/reader/tests/test_split_csv.py", line 52, in run_cli
    self.assertNotIn("can't open file", result.stderr, 'CSV chunk CLI is not implemented yet')
AssertionError: "can't open file" unexpectedly found in "/opt/codex/runtimes/codex-primary-runtime/dependencies/python/bin/python: can't open file '/workspace/scratch/d4ea27e6b1cf/article_batch_5/P16/reader/split_csv.py': [Errno 2] No such file or directory\n" : CSV chunk CLI is not implemented yet

======================================================================
FAIL: test_late_parse_failure_cleans_staged_chunks (test_split_csv.ChunkTests.test_late_parse_failure_cleans_staged_chunks)
----------------------------------------------------------------------
Traceback (most recent call last):
  File "/workspace/scratch/d4ea27e6b1cf/article_batch_5/P16/reader/tests/test_split_csv.py", line 148, in test_late_parse_failure_cleans_staged_chunks
    self.reject()
  File "/workspace/scratch/d4ea27e6b1cf/article_batch_5/P16/reader/tests/test_split_csv.py", line 64, in reject
    result = self.run_cli(limit=limit)
             ^^^^^^^^^^^^^^^^^^^^^^^^^
  File "/workspace/scratch/d4ea27e6b1cf/article_batch_5/P16/reader/tests/test_split_csv.py", line 52, in run_cli
    self.assertNotIn("can't open file", result.stderr, 'CSV chunk CLI is not implemented yet')
AssertionError: "can't open file" unexpectedly found in "/opt/codex/runtimes/codex-primary-runtime/dependencies/python/bin/python: can't open file '/workspace/scratch/d4ea27e6b1cf/article_batch_5/P16/reader/split_csv.py': [Errno 2] No such file or directory\n" : CSV chunk CLI is not implemented yet

======================================================================
FAIL: test_max_one (test_split_csv.ChunkTests.test_max_one)
----------------------------------------------------------------------
Traceback (most recent call last):
  File "/workspace/scratch/d4ea27e6b1cf/article_batch_5/P16/reader/tests/test_split_csv.py", line 90, in test_max_one
    report = self.good(1)
             ^^^^^^^^^^^^
  File "/workspace/scratch/d4ea27e6b1cf/article_batch_5/P16/reader/tests/test_split_csv.py", line 56, in good
    result = self.run_cli(limit=limit, out=out)
             ^^^^^^^^^^^^^^^^^^^^^^^^^^^^^^^^^^
  File "/workspace/scratch/d4ea27e6b1cf/article_batch_5/P16/reader/tests/test_split_csv.py", line 52, in run_cli
    self.assertNotIn("can't open file", result.stderr, 'CSV chunk CLI is not implemented yet')
AssertionError: "can't open file" unexpectedly found in "/opt/codex/runtimes/codex-primary-runtime/dependencies/python/bin/python: can't open file '/workspace/scratch/d4ea27e6b1cf/article_batch_5/P16/reader/split_csv.py': [Errno 2] No such file or directory\n" : CSV chunk CLI is not implemented yet

======================================================================
FAIL: test_max_ten_no_trailing_empty (test_split_csv.ChunkTests.test_max_ten_no_trailing_empty)
----------------------------------------------------------------------
Traceback (most recent call last):
  File "/workspace/scratch/d4ea27e6b1cf/article_batch_5/P16/reader/tests/test_split_csv.py", line 95, in test_max_ten_no_trailing_empty
    report = self.good(10)
             ^^^^^^^^^^^^^
  File "/workspace/scratch/d4ea27e6b1cf/article_batch_5/P16/reader/tests/test_split_csv.py", line 56, in good
    result = self.run_cli(limit=limit, out=out)
             ^^^^^^^^^^^^^^^^^^^^^^^^^^^^^^^^^^
  File "/workspace/scratch/d4ea27e6b1cf/article_batch_5/P16/reader/tests/test_split_csv.py", line 52, in run_cli
    self.assertNotIn("can't open file", result.stderr, 'CSV chunk CLI is not implemented yet')
AssertionError: "can't open file" unexpectedly found in "/opt/codex/runtimes/codex-primary-runtime/dependencies/python/bin/python: can't open file '/workspace/scratch/d4ea27e6b1cf/article_batch_5/P16/reader/split_csv.py': [Errno 2] No such file or directory\n" : CSV chunk CLI is not implemented yet

======================================================================
FAIL: test_missing_output_parent_refused (test_split_csv.ChunkTests.test_missing_output_parent_refused)
----------------------------------------------------------------------
Traceback (most recent call last):
  File "/workspace/scratch/d4ea27e6b1cf/article_batch_5/P16/reader/tests/test_split_csv.py", line 294, in test_missing_output_parent_refused
    result = self.run_cli(out=self.base / 'missing' / 'chunks')
             ^^^^^^^^^^^^^^^^^^^^^^^^^^^^^^^^^^^^^^^^^^^^^^^^^^
  File "/workspace/scratch/d4ea27e6b1cf/article_batch_5/P16/reader/tests/test_split_csv.py", line 52, in run_cli
    self.assertNotIn("can't open file", result.stderr, 'CSV chunk CLI is not implemented yet')
AssertionError: "can't open file" unexpectedly found in "/opt/codex/runtimes/codex-primary-runtime/dependencies/python/bin/python: can't open file '/workspace/scratch/d4ea27e6b1cf/article_batch_5/P16/reader/split_csv.py': [Errno 2] No such file or directory\n" : CSV chunk CLI is not implemented yet

======================================================================
FAIL: test_missing_source_refused (test_split_csv.ChunkTests.test_missing_source_refused)
----------------------------------------------------------------------
Traceback (most recent call last):
  File "/workspace/scratch/d4ea27e6b1cf/article_batch_5/P16/reader/tests/test_split_csv.py", line 311, in test_missing_source_refused
    result = self.run_cli()
             ^^^^^^^^^^^^^^
  File "/workspace/scratch/d4ea27e6b1cf/article_batch_5/P16/reader/tests/test_split_csv.py", line 52, in run_cli
    self.assertNotIn("can't open file", result.stderr, 'CSV chunk CLI is not implemented yet')
AssertionError: "can't open file" unexpectedly found in "/opt/codex/runtimes/codex-primary-runtime/dependencies/python/bin/python: can't open file '/workspace/scratch/d4ea27e6b1cf/article_batch_5/P16/reader/split_csv.py': [Errno 2] No such file or directory\n" : CSV chunk CLI is not implemented yet

======================================================================
FAIL: test_negative_chunk_size (test_split_csv.ChunkTests.test_negative_chunk_size)
----------------------------------------------------------------------
Traceback (most recent call last):
  File "/workspace/scratch/d4ea27e6b1cf/article_batch_5/P16/reader/tests/test_split_csv.py", line 170, in test_negative_chunk_size
    self.reject(limit=-1)
  File "/workspace/scratch/d4ea27e6b1cf/article_batch_5/P16/reader/tests/test_split_csv.py", line 64, in reject
    result = self.run_cli(limit=limit)
             ^^^^^^^^^^^^^^^^^^^^^^^^^
  File "/workspace/scratch/d4ea27e6b1cf/article_batch_5/P16/reader/tests/test_split_csv.py", line 52, in run_cli
    self.assertNotIn("can't open file", result.stderr, 'CSV chunk CLI is not implemented yet')
AssertionError: "can't open file" unexpectedly found in "/opt/codex/runtimes/codex-primary-runtime/dependencies/python/bin/python: can't open file '/workspace/scratch/d4ea27e6b1cf/article_batch_5/P16/reader/split_csv.py': [Errno 2] No such file or directory\n" : CSV chunk CLI is not implemented yet

======================================================================
FAIL: test_noncanonical_id (test_split_csv.ChunkTests.test_noncanonical_id)
----------------------------------------------------------------------
Traceback (most recent call last):
  File "/workspace/scratch/d4ea27e6b1cf/article_batch_5/P16/reader/tests/test_split_csv.py", line 164, in test_noncanonical_id
    self.reject(b'id,item,memo\n01,A,memo\n')
  File "/workspace/scratch/d4ea27e6b1cf/article_batch_5/P16/reader/tests/test_split_csv.py", line 64, in reject
    result = self.run_cli(limit=limit)
             ^^^^^^^^^^^^^^^^^^^^^^^^^
  File "/workspace/scratch/d4ea27e6b1cf/article_batch_5/P16/reader/tests/test_split_csv.py", line 52, in run_cli
    self.assertNotIn("can't open file", result.stderr, 'CSV chunk CLI is not implemented yet')
AssertionError: "can't open file" unexpectedly found in "/opt/codex/runtimes/codex-primary-runtime/dependencies/python/bin/python: can't open file '/workspace/scratch/d4ea27e6b1cf/article_batch_5/P16/reader/split_csv.py': [Errno 2] No such file or directory\n" : CSV chunk CLI is not implemented yet

======================================================================
FAIL: test_noninteger_chunk_size (test_split_csv.ChunkTests.test_noninteger_chunk_size)
----------------------------------------------------------------------
Traceback (most recent call last):
  File "/workspace/scratch/d4ea27e6b1cf/article_batch_5/P16/reader/tests/test_split_csv.py", line 173, in test_noninteger_chunk_size
    result = self.run_cli(limit='1.5')
             ^^^^^^^^^^^^^^^^^^^^^^^^^
  File "/workspace/scratch/d4ea27e6b1cf/article_batch_5/P16/reader/tests/test_split_csv.py", line 52, in run_cli
    self.assertNotIn("can't open file", result.stderr, 'CSV chunk CLI is not implemented yet')
AssertionError: "can't open file" unexpectedly found in "/opt/codex/runtimes/codex-primary-runtime/dependencies/python/bin/python: can't open file '/workspace/scratch/d4ea27e6b1cf/article_batch_5/P16/reader/split_csv.py': [Errno 2] No such file or directory\n" : CSV chunk CLI is not implemented yet

======================================================================
FAIL: test_output_equals_source_preserved (test_split_csv.ChunkTests.test_output_equals_source_preserved)
----------------------------------------------------------------------
Traceback (most recent call last):
  File "/workspace/scratch/d4ea27e6b1cf/article_batch_5/P16/reader/tests/test_split_csv.py", line 300, in test_output_equals_source_preserved
    result = self.run_cli(out=self.source)
             ^^^^^^^^^^^^^^^^^^^^^^^^^^^^^
  File "/workspace/scratch/d4ea27e6b1cf/article_batch_5/P16/reader/tests/test_split_csv.py", line 52, in run_cli
    self.assertNotIn("can't open file", result.stderr, 'CSV chunk CLI is not implemented yet')
AssertionError: "can't open file" unexpectedly found in "/opt/codex/runtimes/codex-primary-runtime/dependencies/python/bin/python: can't open file '/workspace/scratch/d4ea27e6b1cf/article_batch_5/P16/reader/split_csv.py': [Errno 2] No such file or directory\n" : CSV chunk CLI is not implemented yet

======================================================================
FAIL: test_output_parent_symlink_refused (test_split_csv.ChunkTests.test_output_parent_symlink_refused)
----------------------------------------------------------------------
Traceback (most recent call last):
  File "/workspace/scratch/d4ea27e6b1cf/article_batch_5/P16/reader/tests/test_split_csv.py", line 289, in test_output_parent_symlink_refused
    result = self.run_cli(out=link / 'chunks')
             ^^^^^^^^^^^^^^^^^^^^^^^^^^^^^^^^^
  File "/workspace/scratch/d4ea27e6b1cf/article_batch_5/P16/reader/tests/test_split_csv.py", line 52, in run_cli
    self.assertNotIn("can't open file", result.stderr, 'CSV chunk CLI is not implemented yet')
AssertionError: "can't open file" unexpectedly found in "/opt/codex/runtimes/codex-primary-runtime/dependencies/python/bin/python: can't open file '/workspace/scratch/d4ea27e6b1cf/article_batch_5/P16/reader/split_csv.py': [Errno 2] No such file or directory\n" : CSV chunk CLI is not implemented yet

======================================================================
FAIL: test_output_under_source_file_refused (test_split_csv.ChunkTests.test_output_under_source_file_refused)
----------------------------------------------------------------------
Traceback (most recent call last):
  File "/workspace/scratch/d4ea27e6b1cf/article_batch_5/P16/reader/tests/test_split_csv.py", line 305, in test_output_under_source_file_refused
    result = self.run_cli(out=self.source / 'chunks')
             ^^^^^^^^^^^^^^^^^^^^^^^^^^^^^^^^^^^^^^^^
  File "/workspace/scratch/d4ea27e6b1cf/article_batch_5/P16/reader/tests/test_split_csv.py", line 52, in run_cli
    self.assertNotIn("can't open file", result.stderr, 'CSV chunk CLI is not implemented yet')
AssertionError: "can't open file" unexpectedly found in "/opt/codex/runtimes/codex-primary-runtime/dependencies/python/bin/python: can't open file '/workspace/scratch/d4ea27e6b1cf/article_batch_5/P16/reader/split_csv.py': [Errno 2] No such file or directory\n" : CSV chunk CLI is not implemented yet

======================================================================
FAIL: test_quote_followed_by_text (test_split_csv.ChunkTests.test_quote_followed_by_text)
----------------------------------------------------------------------
Traceback (most recent call last):
  File "/workspace/scratch/d4ea27e6b1cf/article_batch_5/P16/reader/tests/test_split_csv.py", line 142, in test_quote_followed_by_text
    self.reject(b'id,item,memo\n1,A,"closed"wrong\n')
  File "/workspace/scratch/d4ea27e6b1cf/article_batch_5/P16/reader/tests/test_split_csv.py", line 64, in reject
    result = self.run_cli(limit=limit)
             ^^^^^^^^^^^^^^^^^^^^^^^^^
  File "/workspace/scratch/d4ea27e6b1cf/article_batch_5/P16/reader/tests/test_split_csv.py", line 52, in run_cli
    self.assertNotIn("can't open file", result.stderr, 'CSV chunk CLI is not implemented yet')
AssertionError: "can't open file" unexpectedly found in "/opt/codex/runtimes/codex-primary-runtime/dependencies/python/bin/python: can't open file '/workspace/scratch/d4ea27e6b1cf/article_batch_5/P16/reader/split_csv.py': [Errno 2] No such file or directory\n" : CSV chunk CLI is not implemented yet

======================================================================
FAIL: test_repeated_header_in_data (test_split_csv.ChunkTests.test_repeated_header_in_data)
----------------------------------------------------------------------
Traceback (most recent call last):
  File "/workspace/scratch/d4ea27e6b1cf/article_batch_5/P16/reader/tests/test_split_csv.py", line 158, in test_repeated_header_in_data
    self.reject()
  File "/workspace/scratch/d4ea27e6b1cf/article_batch_5/P16/reader/tests/test_split_csv.py", line 64, in reject
    result = self.run_cli(limit=limit)
             ^^^^^^^^^^^^^^^^^^^^^^^^^
  File "/workspace/scratch/d4ea27e6b1cf/article_batch_5/P16/reader/tests/test_split_csv.py", line 52, in run_cli
    self.assertNotIn("can't open file", result.stderr, 'CSV chunk CLI is not implemented yet')
AssertionError: "can't open file" unexpectedly found in "/opt/codex/runtimes/codex-primary-runtime/dependencies/python/bin/python: can't open file '/workspace/scratch/d4ea27e6b1cf/article_batch_5/P16/reader/split_csv.py': [Errno 2] No such file or directory\n" : CSV chunk CLI is not implemented yet

======================================================================
FAIL: test_rerun_refuses_and_new_name_works (test_split_csv.ChunkTests.test_rerun_refuses_and_new_name_works)
----------------------------------------------------------------------
Traceback (most recent call last):
  File "/workspace/scratch/d4ea27e6b1cf/article_batch_5/P16/reader/tests/test_split_csv.py", line 208, in test_rerun_refuses_and_new_name_works
    self.good()
  File "/workspace/scratch/d4ea27e6b1cf/article_batch_5/P16/reader/tests/test_split_csv.py", line 56, in good
    result = self.run_cli(limit=limit, out=out)
             ^^^^^^^^^^^^^^^^^^^^^^^^^^^^^^^^^^
  File "/workspace/scratch/d4ea27e6b1cf/article_batch_5/P16/reader/tests/test_split_csv.py", line 52, in run_cli
    self.assertNotIn("can't open file", result.stderr, 'CSV chunk CLI is not implemented yet')
AssertionError: "can't open file" unexpectedly found in "/opt/codex/runtimes/codex-primary-runtime/dependencies/python/bin/python: can't open file '/workspace/scratch/d4ea27e6b1cf/article_batch_5/P16/reader/split_csv.py': [Errno 2] No such file or directory\n" : CSV chunk CLI is not implemented yet

======================================================================
FAIL: test_source_directory_refused (test_split_csv.ChunkTests.test_source_directory_refused)
----------------------------------------------------------------------
Traceback (most recent call last):
  File "/workspace/scratch/d4ea27e6b1cf/article_batch_5/P16/reader/tests/test_split_csv.py", line 318, in test_source_directory_refused
    result = self.run_cli()
             ^^^^^^^^^^^^^^
  File "/workspace/scratch/d4ea27e6b1cf/article_batch_5/P16/reader/tests/test_split_csv.py", line 52, in run_cli
    self.assertNotIn("can't open file", result.stderr, 'CSV chunk CLI is not implemented yet')
AssertionError: "can't open file" unexpectedly found in "/opt/codex/runtimes/codex-primary-runtime/dependencies/python/bin/python: can't open file '/workspace/scratch/d4ea27e6b1cf/article_batch_5/P16/reader/split_csv.py': [Errno 2] No such file or directory\n" : CSV chunk CLI is not implemented yet

======================================================================
FAIL: test_source_symlink_refused (test_split_csv.ChunkTests.test_source_symlink_refused)
----------------------------------------------------------------------
Traceback (most recent call last):
  File "/workspace/scratch/d4ea27e6b1cf/article_batch_5/P16/reader/tests/test_split_csv.py", line 280, in test_source_symlink_refused
    self.assertEqual(self.run_cli().returncode, 2)
                     ^^^^^^^^^^^^^^
  File "/workspace/scratch/d4ea27e6b1cf/article_batch_5/P16/reader/tests/test_split_csv.py", line 52, in run_cli
    self.assertNotIn("can't open file", result.stderr, 'CSV chunk CLI is not implemented yet')
AssertionError: "can't open file" unexpectedly found in "/opt/codex/runtimes/codex-primary-runtime/dependencies/python/bin/python: can't open file '/workspace/scratch/d4ea27e6b1cf/article_batch_5/P16/reader/split_csv.py': [Errno 2] No such file or directory\n" : CSV chunk CLI is not implemented yet

======================================================================
FAIL: test_too_few_fields (test_split_csv.ChunkTests.test_too_few_fields)
----------------------------------------------------------------------
Traceback (most recent call last):
  File "/workspace/scratch/d4ea27e6b1cf/article_batch_5/P16/reader/tests/test_split_csv.py", line 130, in test_too_few_fields
    self.reject(b'id,item,memo\n1,A\n')
  File "/workspace/scratch/d4ea27e6b1cf/article_batch_5/P16/reader/tests/test_split_csv.py", line 64, in reject
    result = self.run_cli(limit=limit)
             ^^^^^^^^^^^^^^^^^^^^^^^^^
  File "/workspace/scratch/d4ea27e6b1cf/article_batch_5/P16/reader/tests/test_split_csv.py", line 52, in run_cli
    self.assertNotIn("can't open file", result.stderr, 'CSV chunk CLI is not implemented yet')
AssertionError: "can't open file" unexpectedly found in "/opt/codex/runtimes/codex-primary-runtime/dependencies/python/bin/python: can't open file '/workspace/scratch/d4ea27e6b1cf/article_batch_5/P16/reader/split_csv.py': [Errno 2] No such file or directory\n" : CSV chunk CLI is not implemented yet

======================================================================
FAIL: test_too_many_fields (test_split_csv.ChunkTests.test_too_many_fields)
----------------------------------------------------------------------
Traceback (most recent call last):
  File "/workspace/scratch/d4ea27e6b1cf/article_batch_5/P16/reader/tests/test_split_csv.py", line 133, in test_too_many_fields
    self.reject(b'id,item,memo\n1,A,B,C\n')
  File "/workspace/scratch/d4ea27e6b1cf/article_batch_5/P16/reader/tests/test_split_csv.py", line 64, in reject
    result = self.run_cli(limit=limit)
             ^^^^^^^^^^^^^^^^^^^^^^^^^
  File "/workspace/scratch/d4ea27e6b1cf/article_batch_5/P16/reader/tests/test_split_csv.py", line 52, in run_cli
    self.assertNotIn("can't open file", result.stderr, 'CSV chunk CLI is not implemented yet')
AssertionError: "can't open file" unexpectedly found in "/opt/codex/runtimes/codex-primary-runtime/dependencies/python/bin/python: can't open file '/workspace/scratch/d4ea27e6b1cf/article_batch_5/P16/reader/split_csv.py': [Errno 2] No such file or directory\n" : CSV chunk CLI is not implemented yet

======================================================================
FAIL: test_two_exact_multiple_ten (test_split_csv.ChunkTests.test_two_exact_multiple_ten)
----------------------------------------------------------------------
Traceback (most recent call last):
  File "/workspace/scratch/d4ea27e6b1cf/article_batch_5/P16/reader/tests/test_split_csv.py", line 106, in test_two_exact_multiple_ten
    self.assertEqual(self.good(2)['rows_per_chunk'], [2] * 5)
                     ^^^^^^^^^^^^
  File "/workspace/scratch/d4ea27e6b1cf/article_batch_5/P16/reader/tests/test_split_csv.py", line 56, in good
    result = self.run_cli(limit=limit, out=out)
             ^^^^^^^^^^^^^^^^^^^^^^^^^^^^^^^^^^
  File "/workspace/scratch/d4ea27e6b1cf/article_batch_5/P16/reader/tests/test_split_csv.py", line 52, in run_cli
    self.assertNotIn("can't open file", result.stderr, 'CSV chunk CLI is not implemented yet')
AssertionError: "can't open file" unexpectedly found in "/opt/codex/runtimes/codex-primary-runtime/dependencies/python/bin/python: can't open file '/workspace/scratch/d4ea27e6b1cf/article_batch_5/P16/reader/split_csv.py': [Errno 2] No such file or directory\n" : CSV chunk CLI is not implemented yet

======================================================================
FAIL: test_unclosed_quote (test_split_csv.ChunkTests.test_unclosed_quote)
----------------------------------------------------------------------
Traceback (most recent call last):
  File "/workspace/scratch/d4ea27e6b1cf/article_batch_5/P16/reader/tests/test_split_csv.py", line 139, in test_unclosed_quote
    self.reject(b'id,item,memo\n1,A,"unclosed\n')
  File "/workspace/scratch/d4ea27e6b1cf/article_batch_5/P16/reader/tests/test_split_csv.py", line 64, in reject
    result = self.run_cli(limit=limit)
             ^^^^^^^^^^^^^^^^^^^^^^^^^
  File "/workspace/scratch/d4ea27e6b1cf/article_batch_5/P16/reader/tests/test_split_csv.py", line 52, in run_cli
    self.assertNotIn("can't open file", result.stderr, 'CSV chunk CLI is not implemented yet')
AssertionError: "can't open file" unexpectedly found in "/opt/codex/runtimes/codex-primary-runtime/dependencies/python/bin/python: can't open file '/workspace/scratch/d4ea27e6b1cf/article_batch_5/P16/reader/split_csv.py': [Errno 2] No such file or directory\n" : CSV chunk CLI is not implemented yet

======================================================================
FAIL: test_utf8_bom_policy (test_split_csv.ChunkTests.test_utf8_bom_policy)
----------------------------------------------------------------------
Traceback (most recent call last):
  File "/workspace/scratch/d4ea27e6b1cf/article_batch_5/P16/reader/tests/test_split_csv.py", line 124, in test_utf8_bom_policy
    self.reject(b'\xef\xbb\xbfid,item,memo\n1,A,B\n')
  File "/workspace/scratch/d4ea27e6b1cf/article_batch_5/P16/reader/tests/test_split_csv.py", line 64, in reject
    result = self.run_cli(limit=limit)
             ^^^^^^^^^^^^^^^^^^^^^^^^^
  File "/workspace/scratch/d4ea27e6b1cf/article_batch_5/P16/reader/tests/test_split_csv.py", line 52, in run_cli
    self.assertNotIn("can't open file", result.stderr, 'CSV chunk CLI is not implemented yet')
AssertionError: "can't open file" unexpectedly found in "/opt/codex/runtimes/codex-primary-runtime/dependencies/python/bin/python: can't open file '/workspace/scratch/d4ea27e6b1cf/article_batch_5/P16/reader/split_csv.py': [Errno 2] No such file or directory\n" : CSV chunk CLI is not implemented yet

======================================================================
FAIL: test_verifier_detects_content_change (test_split_csv.ChunkTests.test_verifier_detects_content_change)
----------------------------------------------------------------------
Traceback (most recent call last):
  File "/workspace/scratch/d4ea27e6b1cf/article_batch_5/P16/reader/tests/test_split_csv.py", line 224, in test_verifier_detects_content_change
    self.good()
  File "/workspace/scratch/d4ea27e6b1cf/article_batch_5/P16/reader/tests/test_split_csv.py", line 56, in good
    result = self.run_cli(limit=limit, out=out)
             ^^^^^^^^^^^^^^^^^^^^^^^^^^^^^^^^^^
  File "/workspace/scratch/d4ea27e6b1cf/article_batch_5/P16/reader/tests/test_split_csv.py", line 52, in run_cli
    self.assertNotIn("can't open file", result.stderr, 'CSV chunk CLI is not implemented yet')
AssertionError: "can't open file" unexpectedly found in "/opt/codex/runtimes/codex-primary-runtime/dependencies/python/bin/python: can't open file '/workspace/scratch/d4ea27e6b1cf/article_batch_5/P16/reader/split_csv.py': [Errno 2] No such file or directory\n" : CSV chunk CLI is not implemented yet

======================================================================
FAIL: test_verifier_detects_duplicate_id (test_split_csv.ChunkTests.test_verifier_detects_duplicate_id)
----------------------------------------------------------------------
Traceback (most recent call last):
  File "/workspace/scratch/d4ea27e6b1cf/article_batch_5/P16/reader/tests/test_split_csv.py", line 248, in test_verifier_detects_duplicate_id
    self.good()
  File "/workspace/scratch/d4ea27e6b1cf/article_batch_5/P16/reader/tests/test_split_csv.py", line 56, in good
    result = self.run_cli(limit=limit, out=out)
             ^^^^^^^^^^^^^^^^^^^^^^^^^^^^^^^^^^
  File "/workspace/scratch/d4ea27e6b1cf/article_batch_5/P16/reader/tests/test_split_csv.py", line 52, in run_cli
    self.assertNotIn("can't open file", result.stderr, 'CSV chunk CLI is not implemented yet')
AssertionError: "can't open file" unexpectedly found in "/opt/codex/runtimes/codex-primary-runtime/dependencies/python/bin/python: can't open file '/workspace/scratch/d4ea27e6b1cf/article_batch_5/P16/reader/split_csv.py': [Errno 2] No such file or directory\n" : CSV chunk CLI is not implemented yet

======================================================================
FAIL: test_verifier_detects_missing_chunk (test_split_csv.ChunkTests.test_verifier_detects_missing_chunk)
----------------------------------------------------------------------
Traceback (most recent call last):
  File "/workspace/scratch/d4ea27e6b1cf/article_batch_5/P16/reader/tests/test_split_csv.py", line 232, in test_verifier_detects_missing_chunk
    self.good()
  File "/workspace/scratch/d4ea27e6b1cf/article_batch_5/P16/reader/tests/test_split_csv.py", line 56, in good
    result = self.run_cli(limit=limit, out=out)
             ^^^^^^^^^^^^^^^^^^^^^^^^^^^^^^^^^^
  File "/workspace/scratch/d4ea27e6b1cf/article_batch_5/P16/reader/tests/test_split_csv.py", line 52, in run_cli
    self.assertNotIn("can't open file", result.stderr, 'CSV chunk CLI is not implemented yet')
AssertionError: "can't open file" unexpectedly found in "/opt/codex/runtimes/codex-primary-runtime/dependencies/python/bin/python: can't open file '/workspace/scratch/d4ea27e6b1cf/article_batch_5/P16/reader/split_csv.py': [Errno 2] No such file or directory\n" : CSV chunk CLI is not implemented yet

======================================================================
FAIL: test_verifier_detects_reordering (test_split_csv.ChunkTests.test_verifier_detects_reordering)
----------------------------------------------------------------------
Traceback (most recent call last):
  File "/workspace/scratch/d4ea27e6b1cf/article_batch_5/P16/reader/tests/test_split_csv.py", line 216, in test_verifier_detects_reordering
    self.good()
  File "/workspace/scratch/d4ea27e6b1cf/article_batch_5/P16/reader/tests/test_split_csv.py", line 56, in good
    result = self.run_cli(limit=limit, out=out)
             ^^^^^^^^^^^^^^^^^^^^^^^^^^^^^^^^^^
  File "/workspace/scratch/d4ea27e6b1cf/article_batch_5/P16/reader/tests/test_split_csv.py", line 52, in run_cli
    self.assertNotIn("can't open file", result.stderr, 'CSV chunk CLI is not implemented yet')
AssertionError: "can't open file" unexpectedly found in "/opt/codex/runtimes/codex-primary-runtime/dependencies/python/bin/python: can't open file '/workspace/scratch/d4ea27e6b1cf/article_batch_5/P16/reader/split_csv.py': [Errno 2] No such file or directory\n" : CSV chunk CLI is not implemented yet

======================================================================
FAIL: test_verifier_detects_repeated_header (test_split_csv.ChunkTests.test_verifier_detects_repeated_header)
----------------------------------------------------------------------
Traceback (most recent call last):
  File "/workspace/scratch/d4ea27e6b1cf/article_batch_5/P16/reader/tests/test_split_csv.py", line 242, in test_verifier_detects_repeated_header
    self.good()
  File "/workspace/scratch/d4ea27e6b1cf/article_batch_5/P16/reader/tests/test_split_csv.py", line 56, in good
    result = self.run_cli(limit=limit, out=out)
             ^^^^^^^^^^^^^^^^^^^^^^^^^^^^^^^^^^
  File "/workspace/scratch/d4ea27e6b1cf/article_batch_5/P16/reader/tests/test_split_csv.py", line 52, in run_cli
    self.assertNotIn("can't open file", result.stderr, 'CSV chunk CLI is not implemented yet')
AssertionError: "can't open file" unexpectedly found in "/opt/codex/runtimes/codex-primary-runtime/dependencies/python/bin/python: can't open file '/workspace/scratch/d4ea27e6b1cf/article_batch_5/P16/reader/split_csv.py': [Errno 2] No such file or directory\n" : CSV chunk CLI is not implemented yet

======================================================================
FAIL: test_verifier_detects_source_bytes_change (test_split_csv.ChunkTests.test_verifier_detects_source_bytes_change)
----------------------------------------------------------------------
Traceback (most recent call last):
  File "/workspace/scratch/d4ea27e6b1cf/article_batch_5/P16/reader/tests/test_split_csv.py", line 256, in test_verifier_detects_source_bytes_change
    self.good()
  File "/workspace/scratch/d4ea27e6b1cf/article_batch_5/P16/reader/tests/test_split_csv.py", line 56, in good
    result = self.run_cli(limit=limit, out=out)
             ^^^^^^^^^^^^^^^^^^^^^^^^^^^^^^^^^^
  File "/workspace/scratch/d4ea27e6b1cf/article_batch_5/P16/reader/tests/test_split_csv.py", line 52, in run_cli
    self.assertNotIn("can't open file", result.stderr, 'CSV chunk CLI is not implemented yet')
AssertionError: "can't open file" unexpectedly found in "/opt/codex/runtimes/codex-primary-runtime/dependencies/python/bin/python: can't open file '/workspace/scratch/d4ea27e6b1cf/article_batch_5/P16/reader/split_csv.py': [Errno 2] No such file or directory\n" : CSV chunk CLI is not implemented yet

======================================================================
FAIL: test_verifier_detects_trailing_empty_chunk (test_split_csv.ChunkTests.test_verifier_detects_trailing_empty_chunk)
----------------------------------------------------------------------
Traceback (most recent call last):
  File "/workspace/scratch/d4ea27e6b1cf/article_batch_5/P16/reader/tests/test_split_csv.py", line 237, in test_verifier_detects_trailing_empty_chunk
    self.good()
  File "/workspace/scratch/d4ea27e6b1cf/article_batch_5/P16/reader/tests/test_split_csv.py", line 56, in good
    result = self.run_cli(limit=limit, out=out)
             ^^^^^^^^^^^^^^^^^^^^^^^^^^^^^^^^^^
  File "/workspace/scratch/d4ea27e6b1cf/article_batch_5/P16/reader/tests/test_split_csv.py", line 52, in run_cli
    self.assertNotIn("can't open file", result.stderr, 'CSV chunk CLI is not implemented yet')
AssertionError: "can't open file" unexpectedly found in "/opt/codex/runtimes/codex-primary-runtime/dependencies/python/bin/python: can't open file '/workspace/scratch/d4ea27e6b1cf/article_batch_5/P16/reader/split_csv.py': [Errno 2] No such file or directory\n" : CSV chunk CLI is not implemented yet

======================================================================
FAIL: test_wrong_header (test_split_csv.ChunkTests.test_wrong_header)
----------------------------------------------------------------------
Traceback (most recent call last):
  File "/workspace/scratch/d4ea27e6b1cf/article_batch_5/P16/reader/tests/test_split_csv.py", line 121, in test_wrong_header
    self.reject(b'id,memo,item\n1,A,B\n')
  File "/workspace/scratch/d4ea27e6b1cf/article_batch_5/P16/reader/tests/test_split_csv.py", line 64, in reject
    result = self.run_cli(limit=limit)
             ^^^^^^^^^^^^^^^^^^^^^^^^^
  File "/workspace/scratch/d4ea27e6b1cf/article_batch_5/P16/reader/tests/test_split_csv.py", line 52, in run_cli
    self.assertNotIn("can't open file", result.stderr, 'CSV chunk CLI is not implemented yet')
AssertionError: "can't open file" unexpectedly found in "/opt/codex/runtimes/codex-primary-runtime/dependencies/python/bin/python: can't open file '/workspace/scratch/d4ea27e6b1cf/article_batch_5/P16/reader/split_csv.py': [Errno 2] No such file or directory\n" : CSV chunk CLI is not implemented yet

======================================================================
FAIL: test_zero_chunk_size (test_split_csv.ChunkTests.test_zero_chunk_size)
----------------------------------------------------------------------
Traceback (most recent call last):
  File "/workspace/scratch/d4ea27e6b1cf/article_batch_5/P16/reader/tests/test_split_csv.py", line 167, in test_zero_chunk_size
    self.reject(limit=0)
  File "/workspace/scratch/d4ea27e6b1cf/article_batch_5/P16/reader/tests/test_split_csv.py", line 64, in reject
    result = self.run_cli(limit=limit)
             ^^^^^^^^^^^^^^^^^^^^^^^^^
  File "/workspace/scratch/d4ea27e6b1cf/article_batch_5/P16/reader/tests/test_split_csv.py", line 52, in run_cli
    self.assertNotIn("can't open file", result.stderr, 'CSV chunk CLI is not implemented yet')
AssertionError: "can't open file" unexpectedly found in "/opt/codex/runtimes/codex-primary-runtime/dependencies/python/bin/python: can't open file '/workspace/scratch/d4ea27e6b1cf/article_batch_5/P16/reader/split_csv.py': [Errno 2] No such file or directory\n" : CSV chunk CLI is not implemented yet

----------------------------------------------------------------------
Ran 44 tests in 0.575s

FAILED (failures=44)
