test_bom_crlf_and_quoted_fields (test_decimal_csv.DecimalCSVTests.test_bom_crlf_and_quoted_fields) ... FAIL
test_existing_output_preserved (test_decimal_csv.DecimalCSVTests.test_existing_output_preserved) ... FAIL
test_existing_symlink_preserved (test_decimal_csv.DecimalCSVTests.test_existing_symlink_preserved) ... FAIL
test_four_fractional_digits (test_decimal_csv.DecimalCSVTests.test_four_fractional_digits) ... FAIL
test_handled_partial_write_removes_new_output (test_decimal_csv.DecimalCSVTests.test_handled_partial_write_removes_new_output) ... FAIL
test_maximum_amount (test_decimal_csv.DecimalCSVTests.test_maximum_amount) ... FAIL
test_maximum_rows_and_precision (test_decimal_csv.DecimalCSVTests.test_maximum_rows_and_precision) ... FAIL
test_normal_rounding_stages (test_decimal_csv.DecimalCSVTests.test_normal_rounding_stages) ... FAIL
test_output_parent_is_file (test_decimal_csv.DecimalCSVTests.test_output_parent_is_file) ... FAIL
test_reject_blank_record (test_decimal_csv.DecimalCSVTests.test_reject_blank_record) ... FAIL
test_reject_duplicate_ids (test_decimal_csv.DecimalCSVTests.test_reject_duplicate_ids) ... FAIL
test_reject_empty_data (test_decimal_csv.DecimalCSVTests.test_reject_empty_data) ... FAIL
test_reject_empty_file (test_decimal_csv.DecimalCSVTests.test_reject_empty_file) ... FAIL
test_reject_exponent (test_decimal_csv.DecimalCSVTests.test_reject_exponent) ... FAIL
test_reject_extra_and_missing_columns (test_decimal_csv.DecimalCSVTests.test_reject_extra_and_missing_columns) ... 
  test_reject_extra_and_missing_columns (test_decimal_csv.DecimalCSVTests.test_reject_extra_and_missing_columns) (row='A,USD,1,extra') ... FAIL
  test_reject_extra_and_missing_columns (test_decimal_csv.DecimalCSVTests.test_reject_extra_and_missing_columns) (row='A,USD') ... FAIL
test_reject_invalid_csv_quotes (test_decimal_csv.DecimalCSVTests.test_reject_invalid_csv_quotes) ... FAIL
test_reject_invalid_ids (test_decimal_csv.DecimalCSVTests.test_reject_invalid_ids) ... 
  test_reject_invalid_ids (test_decimal_csv.DecimalCSVTests.test_reject_invalid_ids) (ident='') ... FAIL
  test_reject_invalid_ids (test_decimal_csv.DecimalCSVTests.test_reject_invalid_ids) (ident='=SUM(A1)') ... FAIL
  test_reject_invalid_ids (test_decimal_csv.DecimalCSVTests.test_reject_invalid_ids) (ident='A B') ... FAIL
  test_reject_invalid_ids (test_decimal_csv.DecimalCSVTests.test_reject_invalid_ids) (ident='가') ... FAIL
  test_reject_invalid_ids (test_decimal_csv.DecimalCSVTests.test_reject_invalid_ids) (ident='AAAAAAAAAAAAAAAAAAAAAAAAAAAAAAAAA') ... FAIL
test_reject_invalid_utf8 (test_decimal_csv.DecimalCSVTests.test_reject_invalid_utf8) ... FAIL
test_reject_malformed_amounts (test_decimal_csv.DecimalCSVTests.test_reject_malformed_amounts) ... 
  test_reject_malformed_amounts (test_decimal_csv.DecimalCSVTests.test_reject_malformed_amounts) (amount='') ... FAIL
  test_reject_malformed_amounts (test_decimal_csv.DecimalCSVTests.test_reject_malformed_amounts) (amount='abc') ... FAIL
  test_reject_malformed_amounts (test_decimal_csv.DecimalCSVTests.test_reject_malformed_amounts) (amount='1_000') ... FAIL
  test_reject_malformed_amounts (test_decimal_csv.DecimalCSVTests.test_reject_malformed_amounts) (amount='01.00') ... FAIL
  test_reject_malformed_amounts (test_decimal_csv.DecimalCSVTests.test_reject_malformed_amounts) (amount='.50') ... FAIL
  test_reject_malformed_amounts (test_decimal_csv.DecimalCSVTests.test_reject_malformed_amounts) (amount='1.') ... FAIL
  test_reject_malformed_amounts (test_decimal_csv.DecimalCSVTests.test_reject_malformed_amounts) (amount='１.０') ... FAIL
  test_reject_malformed_amounts (test_decimal_csv.DecimalCSVTests.test_reject_malformed_amounts) (amount='$1.00') ... FAIL
  test_reject_malformed_amounts (test_decimal_csv.DecimalCSVTests.test_reject_malformed_amounts) (amount='1/2') ... FAIL
test_reject_more_fractional_precision (test_decimal_csv.DecimalCSVTests.test_reject_more_fractional_precision) ... FAIL
test_reject_nonfinite (test_decimal_csv.DecimalCSVTests.test_reject_nonfinite) ... 
  test_reject_nonfinite (test_decimal_csv.DecimalCSVTests.test_reject_nonfinite) (amount='NaN') ... FAIL
  test_reject_nonfinite (test_decimal_csv.DecimalCSVTests.test_reject_nonfinite) (amount='sNaN') ... FAIL
  test_reject_nonfinite (test_decimal_csv.DecimalCSVTests.test_reject_nonfinite) (amount='Infinity') ... FAIL
  test_reject_nonfinite (test_decimal_csv.DecimalCSVTests.test_reject_nonfinite) (amount='-Infinity') ... FAIL
  test_reject_nonfinite (test_decimal_csv.DecimalCSVTests.test_reject_nonfinite) (amount='inf') ... FAIL
test_reject_out_of_range (test_decimal_csv.DecimalCSVTests.test_reject_out_of_range) ... FAIL
test_reject_signed_amounts (test_decimal_csv.DecimalCSVTests.test_reject_signed_amounts) ... 
  test_reject_signed_amounts (test_decimal_csv.DecimalCSVTests.test_reject_signed_amounts) (amount='-1.00') ... FAIL
  test_reject_signed_amounts (test_decimal_csv.DecimalCSVTests.test_reject_signed_amounts) (amount='+1.00') ... FAIL
  test_reject_signed_amounts (test_decimal_csv.DecimalCSVTests.test_reject_signed_amounts) (amount='-0') ... FAIL
  test_reject_signed_amounts (test_decimal_csv.DecimalCSVTests.test_reject_signed_amounts) (amount='-0.00') ... FAIL
test_reject_too_large_file (test_decimal_csv.DecimalCSVTests.test_reject_too_large_file) ... FAIL
test_reject_too_many_rows (test_decimal_csv.DecimalCSVTests.test_reject_too_many_rows) ... FAIL
test_reject_unapproved_currency (test_decimal_csv.DecimalCSVTests.test_reject_unapproved_currency) ... 
  test_reject_unapproved_currency (test_decimal_csv.DecimalCSVTests.test_reject_unapproved_currency) (unit='KRW') ... FAIL
  test_reject_unapproved_currency (test_decimal_csv.DecimalCSVTests.test_reject_unapproved_currency) (unit='EUR') ... FAIL
  test_reject_unapproved_currency (test_decimal_csv.DecimalCSVTests.test_reject_unapproved_currency) (unit='usd') ... FAIL
  test_reject_unapproved_currency (test_decimal_csv.DecimalCSVTests.test_reject_unapproved_currency) (unit='USD/kg') ... FAIL
  test_reject_unapproved_currency (test_decimal_csv.DecimalCSVTests.test_reject_unapproved_currency) (unit='') ... FAIL
test_reject_whitespace (test_decimal_csv.DecimalCSVTests.test_reject_whitespace) ... 
  test_reject_whitespace (test_decimal_csv.DecimalCSVTests.test_reject_whitespace) (row='A,USD, 1.00') ... FAIL
  test_reject_whitespace (test_decimal_csv.DecimalCSVTests.test_reject_whitespace) (row='A,USD,1.00 ') ... FAIL
  test_reject_whitespace (test_decimal_csv.DecimalCSVTests.test_reject_whitespace) (row=' A,USD,1.00') ... FAIL
  test_reject_whitespace (test_decimal_csv.DecimalCSVTests.test_reject_whitespace) (row='A, USD,1.00') ... FAIL
test_reject_wrong_header (test_decimal_csv.DecimalCSVTests.test_reject_wrong_header) ... FAIL
test_rerun_requires_new_name (test_decimal_csv.DecimalCSVTests.test_rerun_requires_new_name) ... FAIL
test_same_path_preserves_input (test_decimal_csv.DecimalCSVTests.test_same_path_preserves_input) ... FAIL
test_wrong_report_extension (test_decimal_csv.DecimalCSVTests.test_wrong_report_extension) ... FAIL
test_zero (test_decimal_csv.DecimalCSVTests.test_zero) ... FAIL

======================================================================
FAIL: test_bom_crlf_and_quoted_fields (test_decimal_csv.DecimalCSVTests.test_bom_crlf_and_quoted_fields)
----------------------------------------------------------------------
Traceback (most recent call last):
  File "/workspace/scratch/d4ea27e6b1cf/article_batch_5/P07/reader/code/test_decimal_csv.py", line 82, in test_bom_crlf_and_quoted_fields
    r = self.accepted(b'\xef\xbb\xbfrecord_id,currency,amount\r\n"0001","USD","0.10"\r\n')
        ^^^^^^^^^^^^^^^^^^^^^^^^^^^^^^^^^^^^^^^^^^^^^^^^^^^^^^^^^^^^^^^^^^^^^^^^^^^^^^^^^^
  File "/workspace/scratch/d4ea27e6b1cf/article_batch_5/P07/reader/code/test_decimal_csv.py", line 37, in accepted
    self.assertEqual(result.returncode, 0, result.stderr)
AssertionError: 1 != 0 : not implemented


======================================================================
FAIL: test_existing_output_preserved (test_decimal_csv.DecimalCSVTests.test_existing_output_preserved)
----------------------------------------------------------------------
Traceback (most recent call last):
  File "/workspace/scratch/d4ea27e6b1cf/article_batch_5/P07/reader/code/test_decimal_csv.py", line 159, in test_existing_output_preserved
    self.assertEqual(r.returncode, 2)
AssertionError: 1 != 2

======================================================================
FAIL: test_existing_symlink_preserved (test_decimal_csv.DecimalCSVTests.test_existing_symlink_preserved)
----------------------------------------------------------------------
Traceback (most recent call last):
  File "/workspace/scratch/d4ea27e6b1cf/article_batch_5/P07/reader/code/test_decimal_csv.py", line 184, in test_existing_symlink_preserved
    self.assertEqual(r.returncode, 2)
AssertionError: 1 != 2

======================================================================
FAIL: test_four_fractional_digits (test_decimal_csv.DecimalCSVTests.test_four_fractional_digits)
----------------------------------------------------------------------
Traceback (most recent call last):
  File "/workspace/scratch/d4ea27e6b1cf/article_batch_5/P07/reader/code/test_decimal_csv.py", line 77, in test_four_fractional_digits
    r = self.accepted(HEADER + 'A,USD,1.0005\n')
        ^^^^^^^^^^^^^^^^^^^^^^^^^^^^^^^^^^^^^^^^
  File "/workspace/scratch/d4ea27e6b1cf/article_batch_5/P07/reader/code/test_decimal_csv.py", line 37, in accepted
    self.assertEqual(result.returncode, 0, result.stderr)
AssertionError: 1 != 0 : not implemented


======================================================================
FAIL: test_handled_partial_write_removes_new_output (test_decimal_csv.DecimalCSVTests.test_handled_partial_write_removes_new_output)
----------------------------------------------------------------------
OSError: not implemented

During handling of the above exception, another exception occurred:

Traceback (most recent call last):
  File "/workspace/scratch/d4ea27e6b1cf/article_batch_5/P07/reader/code/test_decimal_csv.py", line 228, in test_handled_partial_write_removes_new_output
    with self.assertRaisesRegex(OSError, 'injected storage failure'):
         ^^^^^^^^^^^^^^^^^^^^^^^^^^^^^^^^^^^^^^^^^^^^^^^^^^^^^^^^^^^
AssertionError: "injected storage failure" does not match "not implemented"

======================================================================
FAIL: test_maximum_amount (test_decimal_csv.DecimalCSVTests.test_maximum_amount)
----------------------------------------------------------------------
Traceback (most recent call last):
  File "/workspace/scratch/d4ea27e6b1cf/article_batch_5/P07/reader/code/test_decimal_csv.py", line 67, in test_maximum_amount
    r = self.accepted(HEADER + 'MAX,USD,999999.9999\n')
        ^^^^^^^^^^^^^^^^^^^^^^^^^^^^^^^^^^^^^^^^^^^^^^^
  File "/workspace/scratch/d4ea27e6b1cf/article_batch_5/P07/reader/code/test_decimal_csv.py", line 37, in accepted
    self.assertEqual(result.returncode, 0, result.stderr)
AssertionError: 1 != 0 : not implemented


======================================================================
FAIL: test_maximum_rows_and_precision (test_decimal_csv.DecimalCSVTests.test_maximum_rows_and_precision)
----------------------------------------------------------------------
Traceback (most recent call last):
  File "/workspace/scratch/d4ea27e6b1cf/article_batch_5/P07/reader/code/test_decimal_csv.py", line 71, in test_maximum_rows_and_precision
    r = self.accepted(HEADER + ''.join(f'A{i},USD,999999.9999\n' for i in range(10000)))
        ^^^^^^^^^^^^^^^^^^^^^^^^^^^^^^^^^^^^^^^^^^^^^^^^^^^^^^^^^^^^^^^^^^^^^^^^^^^^^^^^
  File "/workspace/scratch/d4ea27e6b1cf/article_batch_5/P07/reader/code/test_decimal_csv.py", line 37, in accepted
    self.assertEqual(result.returncode, 0, result.stderr)
AssertionError: 1 != 0 : not implemented


======================================================================
FAIL: test_normal_rounding_stages (test_decimal_csv.DecimalCSVTests.test_normal_rounding_stages)
----------------------------------------------------------------------
Traceback (most recent call last):
  File "/workspace/scratch/d4ea27e6b1cf/article_batch_5/P07/reader/code/test_decimal_csv.py", line 51, in test_normal_rounding_stages
    r = self.accepted()
        ^^^^^^^^^^^^^^^
  File "/workspace/scratch/d4ea27e6b1cf/article_batch_5/P07/reader/code/test_decimal_csv.py", line 37, in accepted
    self.assertEqual(result.returncode, 0, result.stderr)
AssertionError: 1 != 0 : not implemented


======================================================================
FAIL: test_output_parent_is_file (test_decimal_csv.DecimalCSVTests.test_output_parent_is_file)
----------------------------------------------------------------------
Traceback (most recent call last):
  File "/workspace/scratch/d4ea27e6b1cf/article_batch_5/P07/reader/code/test_decimal_csv.py", line 199, in test_output_parent_is_file
    self.assertEqual(r.returncode, 2)
AssertionError: 1 != 2

======================================================================
FAIL: test_reject_blank_record (test_decimal_csv.DecimalCSVTests.test_reject_blank_record)
----------------------------------------------------------------------
Traceback (most recent call last):
  File "/workspace/scratch/d4ea27e6b1cf/article_batch_5/P07/reader/code/test_decimal_csv.py", line 136, in test_reject_blank_record
    self.rejected(HEADER + 'A,USD,1\n\n', '열 수')
  File "/workspace/scratch/d4ea27e6b1cf/article_batch_5/P07/reader/code/test_decimal_csv.py", line 45, in rejected
    self.assertEqual(result.returncode, 2, result.stderr)
AssertionError: 1 != 2 : not implemented


======================================================================
FAIL: test_reject_duplicate_ids (test_decimal_csv.DecimalCSVTests.test_reject_duplicate_ids)
----------------------------------------------------------------------
Traceback (most recent call last):
  File "/workspace/scratch/d4ea27e6b1cf/article_batch_5/P07/reader/code/test_decimal_csv.py", line 120, in test_reject_duplicate_ids
    self.rejected(HEADER + '0001,USD,1\n0001,USD,2\n', '중복 ID')
  File "/workspace/scratch/d4ea27e6b1cf/article_batch_5/P07/reader/code/test_decimal_csv.py", line 45, in rejected
    self.assertEqual(result.returncode, 2, result.stderr)
AssertionError: 1 != 2 : not implemented


======================================================================
FAIL: test_reject_empty_data (test_decimal_csv.DecimalCSVTests.test_reject_empty_data)
----------------------------------------------------------------------
Traceback (most recent call last):
  File "/workspace/scratch/d4ea27e6b1cf/article_batch_5/P07/reader/code/test_decimal_csv.py", line 139, in test_reject_empty_data
    self.rejected(HEADER, '데이터 행')
  File "/workspace/scratch/d4ea27e6b1cf/article_batch_5/P07/reader/code/test_decimal_csv.py", line 45, in rejected
    self.assertEqual(result.returncode, 2, result.stderr)
AssertionError: 1 != 2 : not implemented


======================================================================
FAIL: test_reject_empty_file (test_decimal_csv.DecimalCSVTests.test_reject_empty_file)
----------------------------------------------------------------------
Traceback (most recent call last):
  File "/workspace/scratch/d4ea27e6b1cf/article_batch_5/P07/reader/code/test_decimal_csv.py", line 142, in test_reject_empty_file
    self.rejected('', '머리글')
  File "/workspace/scratch/d4ea27e6b1cf/article_batch_5/P07/reader/code/test_decimal_csv.py", line 45, in rejected
    self.assertEqual(result.returncode, 2, result.stderr)
AssertionError: 1 != 2 : not implemented


======================================================================
FAIL: test_reject_exponent (test_decimal_csv.DecimalCSVTests.test_reject_exponent)
----------------------------------------------------------------------
Traceback (most recent call last):
  File "/workspace/scratch/d4ea27e6b1cf/article_batch_5/P07/reader/code/test_decimal_csv.py", line 102, in test_reject_exponent
    self.rejected(HEADER + 'A,USD,1e2\n', '금액 표기')
  File "/workspace/scratch/d4ea27e6b1cf/article_batch_5/P07/reader/code/test_decimal_csv.py", line 45, in rejected
    self.assertEqual(result.returncode, 2, result.stderr)
AssertionError: 1 != 2 : not implemented


======================================================================
FAIL: test_reject_extra_and_missing_columns (test_decimal_csv.DecimalCSVTests.test_reject_extra_and_missing_columns) (row='A,USD,1,extra')
----------------------------------------------------------------------
Traceback (most recent call last):
  File "/workspace/scratch/d4ea27e6b1cf/article_batch_5/P07/reader/code/test_decimal_csv.py", line 133, in test_reject_extra_and_missing_columns
    self.rejected(HEADER + row + '\n', '열 수')
  File "/workspace/scratch/d4ea27e6b1cf/article_batch_5/P07/reader/code/test_decimal_csv.py", line 45, in rejected
    self.assertEqual(result.returncode, 2, result.stderr)
AssertionError: 1 != 2 : not implemented


======================================================================
FAIL: test_reject_extra_and_missing_columns (test_decimal_csv.DecimalCSVTests.test_reject_extra_and_missing_columns) (row='A,USD')
----------------------------------------------------------------------
Traceback (most recent call last):
  File "/workspace/scratch/d4ea27e6b1cf/article_batch_5/P07/reader/code/test_decimal_csv.py", line 133, in test_reject_extra_and_missing_columns
    self.rejected(HEADER + row + '\n', '열 수')
  File "/workspace/scratch/d4ea27e6b1cf/article_batch_5/P07/reader/code/test_decimal_csv.py", line 45, in rejected
    self.assertEqual(result.returncode, 2, result.stderr)
AssertionError: 1 != 2 : not implemented


======================================================================
FAIL: test_reject_invalid_csv_quotes (test_decimal_csv.DecimalCSVTests.test_reject_invalid_csv_quotes)
----------------------------------------------------------------------
Traceback (most recent call last):
  File "/workspace/scratch/d4ea27e6b1cf/article_batch_5/P07/reader/code/test_decimal_csv.py", line 148, in test_reject_invalid_csv_quotes
    self.rejected(HEADER + 'A,USD,"1.00\n', 'CSV 구문')
  File "/workspace/scratch/d4ea27e6b1cf/article_batch_5/P07/reader/code/test_decimal_csv.py", line 45, in rejected
    self.assertEqual(result.returncode, 2, result.stderr)
AssertionError: 1 != 2 : not implemented


======================================================================
FAIL: test_reject_invalid_ids (test_decimal_csv.DecimalCSVTests.test_reject_invalid_ids) (ident='')
----------------------------------------------------------------------
Traceback (most recent call last):
  File "/workspace/scratch/d4ea27e6b1cf/article_batch_5/P07/reader/code/test_decimal_csv.py", line 125, in test_reject_invalid_ids
    self.rejected(HEADER + f'{ident},USD,1\n', 'ID 형식')
  File "/workspace/scratch/d4ea27e6b1cf/article_batch_5/P07/reader/code/test_decimal_csv.py", line 45, in rejected
    self.assertEqual(result.returncode, 2, result.stderr)
AssertionError: 1 != 2 : not implemented


======================================================================
FAIL: test_reject_invalid_ids (test_decimal_csv.DecimalCSVTests.test_reject_invalid_ids) (ident='=SUM(A1)')
----------------------------------------------------------------------
Traceback (most recent call last):
  File "/workspace/scratch/d4ea27e6b1cf/article_batch_5/P07/reader/code/test_decimal_csv.py", line 125, in test_reject_invalid_ids
    self.rejected(HEADER + f'{ident},USD,1\n', 'ID 형식')
  File "/workspace/scratch/d4ea27e6b1cf/article_batch_5/P07/reader/code/test_decimal_csv.py", line 45, in rejected
    self.assertEqual(result.returncode, 2, result.stderr)
AssertionError: 1 != 2 : not implemented


======================================================================
FAIL: test_reject_invalid_ids (test_decimal_csv.DecimalCSVTests.test_reject_invalid_ids) (ident='A B')
----------------------------------------------------------------------
Traceback (most recent call last):
  File "/workspace/scratch/d4ea27e6b1cf/article_batch_5/P07/reader/code/test_decimal_csv.py", line 125, in test_reject_invalid_ids
    self.rejected(HEADER + f'{ident},USD,1\n', 'ID 형식')
  File "/workspace/scratch/d4ea27e6b1cf/article_batch_5/P07/reader/code/test_decimal_csv.py", line 45, in rejected
    self.assertEqual(result.returncode, 2, result.stderr)
AssertionError: 1 != 2 : not implemented


======================================================================
FAIL: test_reject_invalid_ids (test_decimal_csv.DecimalCSVTests.test_reject_invalid_ids) (ident='가')
----------------------------------------------------------------------
Traceback (most recent call last):
  File "/workspace/scratch/d4ea27e6b1cf/article_batch_5/P07/reader/code/test_decimal_csv.py", line 125, in test_reject_invalid_ids
    self.rejected(HEADER + f'{ident},USD,1\n', 'ID 형식')
  File "/workspace/scratch/d4ea27e6b1cf/article_batch_5/P07/reader/code/test_decimal_csv.py", line 45, in rejected
    self.assertEqual(result.returncode, 2, result.stderr)
AssertionError: 1 != 2 : not implemented


======================================================================
FAIL: test_reject_invalid_ids (test_decimal_csv.DecimalCSVTests.test_reject_invalid_ids) (ident='AAAAAAAAAAAAAAAAAAAAAAAAAAAAAAAAA')
----------------------------------------------------------------------
Traceback (most recent call last):
  File "/workspace/scratch/d4ea27e6b1cf/article_batch_5/P07/reader/code/test_decimal_csv.py", line 125, in test_reject_invalid_ids
    self.rejected(HEADER + f'{ident},USD,1\n', 'ID 형식')
  File "/workspace/scratch/d4ea27e6b1cf/article_batch_5/P07/reader/code/test_decimal_csv.py", line 45, in rejected
    self.assertEqual(result.returncode, 2, result.stderr)
AssertionError: 1 != 2 : not implemented


======================================================================
FAIL: test_reject_invalid_utf8 (test_decimal_csv.DecimalCSVTests.test_reject_invalid_utf8)
----------------------------------------------------------------------
Traceback (most recent call last):
  File "/workspace/scratch/d4ea27e6b1cf/article_batch_5/P07/reader/code/test_decimal_csv.py", line 145, in test_reject_invalid_utf8
    self.rejected(HEADER.encode() + b'A,USD,\xff\n', 'UTF-8')
  File "/workspace/scratch/d4ea27e6b1cf/article_batch_5/P07/reader/code/test_decimal_csv.py", line 45, in rejected
    self.assertEqual(result.returncode, 2, result.stderr)
AssertionError: 1 != 2 : not implemented


======================================================================
FAIL: test_reject_malformed_amounts (test_decimal_csv.DecimalCSVTests.test_reject_malformed_amounts) (amount='')
----------------------------------------------------------------------
Traceback (most recent call last):
  File "/workspace/scratch/d4ea27e6b1cf/article_batch_5/P07/reader/code/test_decimal_csv.py", line 112, in test_reject_malformed_amounts
    self.rejected(HEADER + f'A,USD,{amount}\n', '금액 표기')
  File "/workspace/scratch/d4ea27e6b1cf/article_batch_5/P07/reader/code/test_decimal_csv.py", line 45, in rejected
    self.assertEqual(result.returncode, 2, result.stderr)
AssertionError: 1 != 2 : not implemented


======================================================================
FAIL: test_reject_malformed_amounts (test_decimal_csv.DecimalCSVTests.test_reject_malformed_amounts) (amount='abc')
----------------------------------------------------------------------
Traceback (most recent call last):
  File "/workspace/scratch/d4ea27e6b1cf/article_batch_5/P07/reader/code/test_decimal_csv.py", line 112, in test_reject_malformed_amounts
    self.rejected(HEADER + f'A,USD,{amount}\n', '금액 표기')
  File "/workspace/scratch/d4ea27e6b1cf/article_batch_5/P07/reader/code/test_decimal_csv.py", line 45, in rejected
    self.assertEqual(result.returncode, 2, result.stderr)
AssertionError: 1 != 2 : not implemented


======================================================================
FAIL: test_reject_malformed_amounts (test_decimal_csv.DecimalCSVTests.test_reject_malformed_amounts) (amount='1_000')
----------------------------------------------------------------------
Traceback (most recent call last):
  File "/workspace/scratch/d4ea27e6b1cf/article_batch_5/P07/reader/code/test_decimal_csv.py", line 112, in test_reject_malformed_amounts
    self.rejected(HEADER + f'A,USD,{amount}\n', '금액 표기')
  File "/workspace/scratch/d4ea27e6b1cf/article_batch_5/P07/reader/code/test_decimal_csv.py", line 45, in rejected
    self.assertEqual(result.returncode, 2, result.stderr)
AssertionError: 1 != 2 : not implemented


======================================================================
FAIL: test_reject_malformed_amounts (test_decimal_csv.DecimalCSVTests.test_reject_malformed_amounts) (amount='01.00')
----------------------------------------------------------------------
Traceback (most recent call last):
  File "/workspace/scratch/d4ea27e6b1cf/article_batch_5/P07/reader/code/test_decimal_csv.py", line 112, in test_reject_malformed_amounts
    self.rejected(HEADER + f'A,USD,{amount}\n', '금액 표기')
  File "/workspace/scratch/d4ea27e6b1cf/article_batch_5/P07/reader/code/test_decimal_csv.py", line 45, in rejected
    self.assertEqual(result.returncode, 2, result.stderr)
AssertionError: 1 != 2 : not implemented


======================================================================
FAIL: test_reject_malformed_amounts (test_decimal_csv.DecimalCSVTests.test_reject_malformed_amounts) (amount='.50')
----------------------------------------------------------------------
Traceback (most recent call last):
  File "/workspace/scratch/d4ea27e6b1cf/article_batch_5/P07/reader/code/test_decimal_csv.py", line 112, in test_reject_malformed_amounts
    self.rejected(HEADER + f'A,USD,{amount}\n', '금액 표기')
  File "/workspace/scratch/d4ea27e6b1cf/article_batch_5/P07/reader/code/test_decimal_csv.py", line 45, in rejected
    self.assertEqual(result.returncode, 2, result.stderr)
AssertionError: 1 != 2 : not implemented


======================================================================
FAIL: test_reject_malformed_amounts (test_decimal_csv.DecimalCSVTests.test_reject_malformed_amounts) (amount='1.')
----------------------------------------------------------------------
Traceback (most recent call last):
  File "/workspace/scratch/d4ea27e6b1cf/article_batch_5/P07/reader/code/test_decimal_csv.py", line 112, in test_reject_malformed_amounts
    self.rejected(HEADER + f'A,USD,{amount}\n', '금액 표기')
  File "/workspace/scratch/d4ea27e6b1cf/article_batch_5/P07/reader/code/test_decimal_csv.py", line 45, in rejected
    self.assertEqual(result.returncode, 2, result.stderr)
AssertionError: 1 != 2 : not implemented


======================================================================
FAIL: test_reject_malformed_amounts (test_decimal_csv.DecimalCSVTests.test_reject_malformed_amounts) (amount='１.０')
----------------------------------------------------------------------
Traceback (most recent call last):
  File "/workspace/scratch/d4ea27e6b1cf/article_batch_5/P07/reader/code/test_decimal_csv.py", line 112, in test_reject_malformed_amounts
    self.rejected(HEADER + f'A,USD,{amount}\n', '금액 표기')
  File "/workspace/scratch/d4ea27e6b1cf/article_batch_5/P07/reader/code/test_decimal_csv.py", line 45, in rejected
    self.assertEqual(result.returncode, 2, result.stderr)
AssertionError: 1 != 2 : not implemented


======================================================================
FAIL: test_reject_malformed_amounts (test_decimal_csv.DecimalCSVTests.test_reject_malformed_amounts) (amount='$1.00')
----------------------------------------------------------------------
Traceback (most recent call last):
  File "/workspace/scratch/d4ea27e6b1cf/article_batch_5/P07/reader/code/test_decimal_csv.py", line 112, in test_reject_malformed_amounts
    self.rejected(HEADER + f'A,USD,{amount}\n', '금액 표기')
  File "/workspace/scratch/d4ea27e6b1cf/article_batch_5/P07/reader/code/test_decimal_csv.py", line 45, in rejected
    self.assertEqual(result.returncode, 2, result.stderr)
AssertionError: 1 != 2 : not implemented


======================================================================
FAIL: test_reject_malformed_amounts (test_decimal_csv.DecimalCSVTests.test_reject_malformed_amounts) (amount='1/2')
----------------------------------------------------------------------
Traceback (most recent call last):
  File "/workspace/scratch/d4ea27e6b1cf/article_batch_5/P07/reader/code/test_decimal_csv.py", line 112, in test_reject_malformed_amounts
    self.rejected(HEADER + f'A,USD,{amount}\n', '금액 표기')
  File "/workspace/scratch/d4ea27e6b1cf/article_batch_5/P07/reader/code/test_decimal_csv.py", line 45, in rejected
    self.assertEqual(result.returncode, 2, result.stderr)
AssertionError: 1 != 2 : not implemented


======================================================================
FAIL: test_reject_more_fractional_precision (test_decimal_csv.DecimalCSVTests.test_reject_more_fractional_precision)
----------------------------------------------------------------------
Traceback (most recent call last):
  File "/workspace/scratch/d4ea27e6b1cf/article_batch_5/P07/reader/code/test_decimal_csv.py", line 89, in test_reject_more_fractional_precision
    self.rejected(HEADER + 'A,USD,0.00001\n', '금액 표기')
  File "/workspace/scratch/d4ea27e6b1cf/article_batch_5/P07/reader/code/test_decimal_csv.py", line 45, in rejected
    self.assertEqual(result.returncode, 2, result.stderr)
AssertionError: 1 != 2 : not implemented


======================================================================
FAIL: test_reject_nonfinite (test_decimal_csv.DecimalCSVTests.test_reject_nonfinite) (amount='NaN')
----------------------------------------------------------------------
Traceback (most recent call last):
  File "/workspace/scratch/d4ea27e6b1cf/article_batch_5/P07/reader/code/test_decimal_csv.py", line 107, in test_reject_nonfinite
    self.rejected(HEADER + f'A,USD,{amount}\n', '금액 표기')
  File "/workspace/scratch/d4ea27e6b1cf/article_batch_5/P07/reader/code/test_decimal_csv.py", line 45, in rejected
    self.assertEqual(result.returncode, 2, result.stderr)
AssertionError: 1 != 2 : not implemented


======================================================================
FAIL: test_reject_nonfinite (test_decimal_csv.DecimalCSVTests.test_reject_nonfinite) (amount='sNaN')
----------------------------------------------------------------------
Traceback (most recent call last):
  File "/workspace/scratch/d4ea27e6b1cf/article_batch_5/P07/reader/code/test_decimal_csv.py", line 107, in test_reject_nonfinite
    self.rejected(HEADER + f'A,USD,{amount}\n', '금액 표기')
  File "/workspace/scratch/d4ea27e6b1cf/article_batch_5/P07/reader/code/test_decimal_csv.py", line 45, in rejected
    self.assertEqual(result.returncode, 2, result.stderr)
AssertionError: 1 != 2 : not implemented


======================================================================
FAIL: test_reject_nonfinite (test_decimal_csv.DecimalCSVTests.test_reject_nonfinite) (amount='Infinity')
----------------------------------------------------------------------
Traceback (most recent call last):
  File "/workspace/scratch/d4ea27e6b1cf/article_batch_5/P07/reader/code/test_decimal_csv.py", line 107, in test_reject_nonfinite
    self.rejected(HEADER + f'A,USD,{amount}\n', '금액 표기')
  File "/workspace/scratch/d4ea27e6b1cf/article_batch_5/P07/reader/code/test_decimal_csv.py", line 45, in rejected
    self.assertEqual(result.returncode, 2, result.stderr)
AssertionError: 1 != 2 : not implemented


======================================================================
FAIL: test_reject_nonfinite (test_decimal_csv.DecimalCSVTests.test_reject_nonfinite) (amount='-Infinity')
----------------------------------------------------------------------
Traceback (most recent call last):
  File "/workspace/scratch/d4ea27e6b1cf/article_batch_5/P07/reader/code/test_decimal_csv.py", line 107, in test_reject_nonfinite
    self.rejected(HEADER + f'A,USD,{amount}\n', '금액 표기')
  File "/workspace/scratch/d4ea27e6b1cf/article_batch_5/P07/reader/code/test_decimal_csv.py", line 45, in rejected
    self.assertEqual(result.returncode, 2, result.stderr)
AssertionError: 1 != 2 : not implemented


======================================================================
FAIL: test_reject_nonfinite (test_decimal_csv.DecimalCSVTests.test_reject_nonfinite) (amount='inf')
----------------------------------------------------------------------
Traceback (most recent call last):
  File "/workspace/scratch/d4ea27e6b1cf/article_batch_5/P07/reader/code/test_decimal_csv.py", line 107, in test_reject_nonfinite
    self.rejected(HEADER + f'A,USD,{amount}\n', '금액 표기')
  File "/workspace/scratch/d4ea27e6b1cf/article_batch_5/P07/reader/code/test_decimal_csv.py", line 45, in rejected
    self.assertEqual(result.returncode, 2, result.stderr)
AssertionError: 1 != 2 : not implemented


======================================================================
FAIL: test_reject_out_of_range (test_decimal_csv.DecimalCSVTests.test_reject_out_of_range)
----------------------------------------------------------------------
Traceback (most recent call last):
  File "/workspace/scratch/d4ea27e6b1cf/article_batch_5/P07/reader/code/test_decimal_csv.py", line 86, in test_reject_out_of_range
    self.rejected(HEADER + 'A,USD,1000000\n', '금액 범위')
  File "/workspace/scratch/d4ea27e6b1cf/article_batch_5/P07/reader/code/test_decimal_csv.py", line 45, in rejected
    self.assertEqual(result.returncode, 2, result.stderr)
AssertionError: 1 != 2 : not implemented


======================================================================
FAIL: test_reject_signed_amounts (test_decimal_csv.DecimalCSVTests.test_reject_signed_amounts) (amount='-1.00')
----------------------------------------------------------------------
Traceback (most recent call last):
  File "/workspace/scratch/d4ea27e6b1cf/article_batch_5/P07/reader/code/test_decimal_csv.py", line 94, in test_reject_signed_amounts
    self.rejected(HEADER + f'A,USD,{amount}\n', '금액 표기')
  File "/workspace/scratch/d4ea27e6b1cf/article_batch_5/P07/reader/code/test_decimal_csv.py", line 45, in rejected
    self.assertEqual(result.returncode, 2, result.stderr)
AssertionError: 1 != 2 : not implemented


======================================================================
FAIL: test_reject_signed_amounts (test_decimal_csv.DecimalCSVTests.test_reject_signed_amounts) (amount='+1.00')
----------------------------------------------------------------------
Traceback (most recent call last):
  File "/workspace/scratch/d4ea27e6b1cf/article_batch_5/P07/reader/code/test_decimal_csv.py", line 94, in test_reject_signed_amounts
    self.rejected(HEADER + f'A,USD,{amount}\n', '금액 표기')
  File "/workspace/scratch/d4ea27e6b1cf/article_batch_5/P07/reader/code/test_decimal_csv.py", line 45, in rejected
    self.assertEqual(result.returncode, 2, result.stderr)
AssertionError: 1 != 2 : not implemented


======================================================================
FAIL: test_reject_signed_amounts (test_decimal_csv.DecimalCSVTests.test_reject_signed_amounts) (amount='-0')
----------------------------------------------------------------------
Traceback (most recent call last):
  File "/workspace/scratch/d4ea27e6b1cf/article_batch_5/P07/reader/code/test_decimal_csv.py", line 94, in test_reject_signed_amounts
    self.rejected(HEADER + f'A,USD,{amount}\n', '금액 표기')
  File "/workspace/scratch/d4ea27e6b1cf/article_batch_5/P07/reader/code/test_decimal_csv.py", line 45, in rejected
    self.assertEqual(result.returncode, 2, result.stderr)
AssertionError: 1 != 2 : not implemented


======================================================================
FAIL: test_reject_signed_amounts (test_decimal_csv.DecimalCSVTests.test_reject_signed_amounts) (amount='-0.00')
----------------------------------------------------------------------
Traceback (most recent call last):
  File "/workspace/scratch/d4ea27e6b1cf/article_batch_5/P07/reader/code/test_decimal_csv.py", line 94, in test_reject_signed_amounts
    self.rejected(HEADER + f'A,USD,{amount}\n', '금액 표기')
  File "/workspace/scratch/d4ea27e6b1cf/article_batch_5/P07/reader/code/test_decimal_csv.py", line 45, in rejected
    self.assertEqual(result.returncode, 2, result.stderr)
AssertionError: 1 != 2 : not implemented


======================================================================
FAIL: test_reject_too_large_file (test_decimal_csv.DecimalCSVTests.test_reject_too_large_file)
----------------------------------------------------------------------
Traceback (most recent call last):
  File "/workspace/scratch/d4ea27e6b1cf/article_batch_5/P07/reader/code/test_decimal_csv.py", line 154, in test_reject_too_large_file
    self.rejected(b'A' * 2_000_001, '바이트 한도')
  File "/workspace/scratch/d4ea27e6b1cf/article_batch_5/P07/reader/code/test_decimal_csv.py", line 45, in rejected
    self.assertEqual(result.returncode, 2, result.stderr)
AssertionError: 1 != 2 : not implemented


======================================================================
FAIL: test_reject_too_many_rows (test_decimal_csv.DecimalCSVTests.test_reject_too_many_rows)
----------------------------------------------------------------------
Traceback (most recent call last):
  File "/workspace/scratch/d4ea27e6b1cf/article_batch_5/P07/reader/code/test_decimal_csv.py", line 151, in test_reject_too_many_rows
    self.rejected(HEADER + ''.join(f'A{i},USD,0\n' for i in range(10001)), '행 한도')
  File "/workspace/scratch/d4ea27e6b1cf/article_batch_5/P07/reader/code/test_decimal_csv.py", line 45, in rejected
    self.assertEqual(result.returncode, 2, result.stderr)
AssertionError: 1 != 2 : not implemented


======================================================================
FAIL: test_reject_unapproved_currency (test_decimal_csv.DecimalCSVTests.test_reject_unapproved_currency) (unit='KRW')
----------------------------------------------------------------------
Traceback (most recent call last):
  File "/workspace/scratch/d4ea27e6b1cf/article_batch_5/P07/reader/code/test_decimal_csv.py", line 117, in test_reject_unapproved_currency
    self.rejected(HEADER + f'A,{unit},1.00\n', '통화')
  File "/workspace/scratch/d4ea27e6b1cf/article_batch_5/P07/reader/code/test_decimal_csv.py", line 45, in rejected
    self.assertEqual(result.returncode, 2, result.stderr)
AssertionError: 1 != 2 : not implemented


======================================================================
FAIL: test_reject_unapproved_currency (test_decimal_csv.DecimalCSVTests.test_reject_unapproved_currency) (unit='EUR')
----------------------------------------------------------------------
Traceback (most recent call last):
  File "/workspace/scratch/d4ea27e6b1cf/article_batch_5/P07/reader/code/test_decimal_csv.py", line 117, in test_reject_unapproved_currency
    self.rejected(HEADER + f'A,{unit},1.00\n', '통화')
  File "/workspace/scratch/d4ea27e6b1cf/article_batch_5/P07/reader/code/test_decimal_csv.py", line 45, in rejected
    self.assertEqual(result.returncode, 2, result.stderr)
AssertionError: 1 != 2 : not implemented


======================================================================
FAIL: test_reject_unapproved_currency (test_decimal_csv.DecimalCSVTests.test_reject_unapproved_currency) (unit='usd')
----------------------------------------------------------------------
Traceback (most recent call last):
  File "/workspace/scratch/d4ea27e6b1cf/article_batch_5/P07/reader/code/test_decimal_csv.py", line 117, in test_reject_unapproved_currency
    self.rejected(HEADER + f'A,{unit},1.00\n', '통화')
  File "/workspace/scratch/d4ea27e6b1cf/article_batch_5/P07/reader/code/test_decimal_csv.py", line 45, in rejected
    self.assertEqual(result.returncode, 2, result.stderr)
AssertionError: 1 != 2 : not implemented


======================================================================
FAIL: test_reject_unapproved_currency (test_decimal_csv.DecimalCSVTests.test_reject_unapproved_currency) (unit='USD/kg')
----------------------------------------------------------------------
Traceback (most recent call last):
  File "/workspace/scratch/d4ea27e6b1cf/article_batch_5/P07/reader/code/test_decimal_csv.py", line 117, in test_reject_unapproved_currency
    self.rejected(HEADER + f'A,{unit},1.00\n', '통화')
  File "/workspace/scratch/d4ea27e6b1cf/article_batch_5/P07/reader/code/test_decimal_csv.py", line 45, in rejected
    self.assertEqual(result.returncode, 2, result.stderr)
AssertionError: 1 != 2 : not implemented


======================================================================
FAIL: test_reject_unapproved_currency (test_decimal_csv.DecimalCSVTests.test_reject_unapproved_currency) (unit='')
----------------------------------------------------------------------
Traceback (most recent call last):
  File "/workspace/scratch/d4ea27e6b1cf/article_batch_5/P07/reader/code/test_decimal_csv.py", line 117, in test_reject_unapproved_currency
    self.rejected(HEADER + f'A,{unit},1.00\n', '통화')
  File "/workspace/scratch/d4ea27e6b1cf/article_batch_5/P07/reader/code/test_decimal_csv.py", line 45, in rejected
    self.assertEqual(result.returncode, 2, result.stderr)
AssertionError: 1 != 2 : not implemented


======================================================================
FAIL: test_reject_whitespace (test_decimal_csv.DecimalCSVTests.test_reject_whitespace) (row='A,USD, 1.00')
----------------------------------------------------------------------
Traceback (most recent call last):
  File "/workspace/scratch/d4ea27e6b1cf/article_batch_5/P07/reader/code/test_decimal_csv.py", line 99, in test_reject_whitespace
    self.rejected(HEADER + row + '\n', '오류:')
  File "/workspace/scratch/d4ea27e6b1cf/article_batch_5/P07/reader/code/test_decimal_csv.py", line 45, in rejected
    self.assertEqual(result.returncode, 2, result.stderr)
AssertionError: 1 != 2 : not implemented


======================================================================
FAIL: test_reject_whitespace (test_decimal_csv.DecimalCSVTests.test_reject_whitespace) (row='A,USD,1.00 ')
----------------------------------------------------------------------
Traceback (most recent call last):
  File "/workspace/scratch/d4ea27e6b1cf/article_batch_5/P07/reader/code/test_decimal_csv.py", line 99, in test_reject_whitespace
    self.rejected(HEADER + row + '\n', '오류:')
  File "/workspace/scratch/d4ea27e6b1cf/article_batch_5/P07/reader/code/test_decimal_csv.py", line 45, in rejected
    self.assertEqual(result.returncode, 2, result.stderr)
AssertionError: 1 != 2 : not implemented


======================================================================
FAIL: test_reject_whitespace (test_decimal_csv.DecimalCSVTests.test_reject_whitespace) (row=' A,USD,1.00')
----------------------------------------------------------------------
Traceback (most recent call last):
  File "/workspace/scratch/d4ea27e6b1cf/article_batch_5/P07/reader/code/test_decimal_csv.py", line 99, in test_reject_whitespace
    self.rejected(HEADER + row + '\n', '오류:')
  File "/workspace/scratch/d4ea27e6b1cf/article_batch_5/P07/reader/code/test_decimal_csv.py", line 45, in rejected
    self.assertEqual(result.returncode, 2, result.stderr)
AssertionError: 1 != 2 : not implemented


======================================================================
FAIL: test_reject_whitespace (test_decimal_csv.DecimalCSVTests.test_reject_whitespace) (row='A, USD,1.00')
----------------------------------------------------------------------
Traceback (most recent call last):
  File "/workspace/scratch/d4ea27e6b1cf/article_batch_5/P07/reader/code/test_decimal_csv.py", line 99, in test_reject_whitespace
    self.rejected(HEADER + row + '\n', '오류:')
  File "/workspace/scratch/d4ea27e6b1cf/article_batch_5/P07/reader/code/test_decimal_csv.py", line 45, in rejected
    self.assertEqual(result.returncode, 2, result.stderr)
AssertionError: 1 != 2 : not implemented


======================================================================
FAIL: test_reject_wrong_header (test_decimal_csv.DecimalCSVTests.test_reject_wrong_header)
----------------------------------------------------------------------
Traceback (most recent call last):
  File "/workspace/scratch/d4ea27e6b1cf/article_batch_5/P07/reader/code/test_decimal_csv.py", line 128, in test_reject_wrong_header
    self.rejected('amount,currency,record_id\n1,USD,A\n', '머리글')
  File "/workspace/scratch/d4ea27e6b1cf/article_batch_5/P07/reader/code/test_decimal_csv.py", line 45, in rejected
    self.assertEqual(result.returncode, 2, result.stderr)
AssertionError: 1 != 2 : not implemented


======================================================================
FAIL: test_rerun_requires_new_name (test_decimal_csv.DecimalCSVTests.test_rerun_requires_new_name)
----------------------------------------------------------------------
Traceback (most recent call last):
  File "/workspace/scratch/d4ea27e6b1cf/article_batch_5/P07/reader/code/test_decimal_csv.py", line 164, in test_rerun_requires_new_name
    first = self.accepted()
            ^^^^^^^^^^^^^^^
  File "/workspace/scratch/d4ea27e6b1cf/article_batch_5/P07/reader/code/test_decimal_csv.py", line 37, in accepted
    self.assertEqual(result.returncode, 0, result.stderr)
AssertionError: 1 != 0 : not implemented


======================================================================
FAIL: test_same_path_preserves_input (test_decimal_csv.DecimalCSVTests.test_same_path_preserves_input)
----------------------------------------------------------------------
Traceback (most recent call last):
  File "/workspace/scratch/d4ea27e6b1cf/article_batch_5/P07/reader/code/test_decimal_csv.py", line 176, in test_same_path_preserves_input
    self.assertEqual(r.returncode, 2)
AssertionError: 1 != 2

======================================================================
FAIL: test_wrong_report_extension (test_decimal_csv.DecimalCSVTests.test_wrong_report_extension)
----------------------------------------------------------------------
Traceback (most recent call last):
  File "/workspace/scratch/d4ea27e6b1cf/article_batch_5/P07/reader/code/test_decimal_csv.py", line 191, in test_wrong_report_extension
    self.assertEqual(r.returncode, 2)
AssertionError: 1 != 2

======================================================================
FAIL: test_zero (test_decimal_csv.DecimalCSVTests.test_zero)
----------------------------------------------------------------------
Traceback (most recent call last):
  File "/workspace/scratch/d4ea27e6b1cf/article_batch_5/P07/reader/code/test_decimal_csv.py", line 62, in test_zero
    r = self.accepted(HEADER + 'ZERO,USD,0.0000\n')
        ^^^^^^^^^^^^^^^^^^^^^^^^^^^^^^^^^^^^^^^^^^^
  File "/workspace/scratch/d4ea27e6b1cf/article_batch_5/P07/reader/code/test_decimal_csv.py", line 37, in accepted
    self.assertEqual(result.returncode, 0, result.stderr)
AssertionError: 1 != 0 : not implemented


----------------------------------------------------------------------
Ran 32 tests in 0.736s

FAILED (failures=59)

RED_EXIT_CODE=1
